{"text_format":"1","workbook":"xlsx","n_sheets":3,"sheets":["HistoricoAdministracion","Descripciòn","ZonasPagasVigentes"],"not_rendered":{"charts":0,"images":0,"macros":1,"external_links":0,"defined_names":3,"comments":3,"pivot_tables":0},"unopened":[],"bounds":{"document_bytes":16777216,"sheet_cells":100000,"rows_first":2000,"rows_last":500,"rows_between":2000,"halvings":0,"cell_chars":16384,"cell_head_chars":4096},"cells_cut":0,"cells_raw":0,"read":"whole","date_system":"1900"}

{"sheet":"HistoricoAdministracion","index":0,"n_rows":448,"n_cols":10,"rows_kept":448,"cut":false,"hidden":true,"merged":[]}
["Cod ZP","Estado ","Comentario ","Tipo de Día en que Opera","Inicio de Operación Laboral","Fin Operación Laboral","Inicio de Operación Sábado","Fin Operación Sábado","Inicio de Operación Domingo","Fin Operación Domingo"]
[1,{"$f":"INDEX(#REF!,MATCH(A2,#REF!,0))","v":{"$error":"#REF!"}},"a partir del 08-11-2010 es compartida - optimiza horario de operación desde 01-06-2016",null,{"$f":"VLOOKUP(A2,#REF!,68,FALSE)","v":{"$error":"#REF!"}}]
[2,{"$f":"INDEX(#REF!,MATCH(A3,#REF!,0))","v":{"$error":"#REF!"}},"a partir del 08-11-2010 es compartida - optimiza horario de operación desde 01-06-2016",null,{"$f":"VLOOKUP(A3,#REF!,68,FALSE)","v":{"$error":"#REF!"}}]
[3,{"$f":"INDEX(#REF!,MATCH(A4,#REF!,0))","v":{"$error":"#REF!"}},"optimiza horario de operación desde 01-06-2016",null,{"$f":"VLOOKUP(A4,#REF!,68,FALSE)","v":{"$error":"#REF!"}}]
[4,{"$f":"INDEX(#REF!,MATCH(A5,#REF!,0))","v":{"$error":"#REF!"}},"por análisis financiero desde 25-03-2016",null,{"$f":"VLOOKUP(A5,#REF!,68,FALSE)","v":{"$error":"#REF!"}},"2016-03-25"]
[5,{"$f":"INDEX(#REF!,MATCH(A6,#REF!,0))","v":{"$error":"#REF!"}},"optimiza horario de operación desde 01-06-2016",null,{"$f":"VLOOKUP(A6,#REF!,68,FALSE)","v":{"$error":"#REF!"}}]
[6,{"$f":"INDEX(#REF!,MATCH(A7,#REF!,0))","v":{"$error":"#REF!"}},"optimiza horario de operación desde 01-06-2016",null,{"$f":"VLOOKUP(A7,#REF!,68,FALSE)","v":{"$error":"#REF!"}}]
[7,{"$f":"INDEX(#REF!,MATCH(A8,#REF!,0))","v":{"$error":"#REF!"}},null,null,{"$f":"VLOOKUP(A8,#REF!,68,FALSE)","v":{"$error":"#REF!"}}]
[8,{"$f":"INDEX(#REF!,MATCH(A9,#REF!,0))","v":{"$error":"#REF!"}},"optimiza horario de operación desde 01-06-2016",null,{"$f":"VLOOKUP(A9,#REF!,68,FALSE)","v":{"$error":"#REF!"}}]
[9,{"$f":"INDEX(#REF!,MATCH(A10,#REF!,0))","v":{"$error":"#REF!"}},"optimiza horario de operación desde 01-06-2016",null,{"$f":"VLOOKUP(A10,#REF!,68,FALSE)","v":{"$error":"#REF!"}}]
[10,{"$f":"INDEX(#REF!,MATCH(A11,#REF!,0))","v":{"$error":"#REF!"}},"optimiza horario de operación desde 01-06-2016",null,{"$f":"VLOOKUP(A11,#REF!,68,FALSE)","v":{"$error":"#REF!"}}]
[11,{"$f":"INDEX(#REF!,MATCH(A12,#REF!,0))","v":{"$error":"#REF!"}},"optimiza horario de operación desde 01-06-2016",null,{"$f":"VLOOKUP(A12,#REF!,68,FALSE)","v":{"$error":"#REF!"}}]
[12,{"$f":"INDEX(#REF!,MATCH(A13,#REF!,0))","v":{"$error":"#REF!"}},"optimiza horario de operación desde 01-06-2016",null,{"$f":"VLOOKUP(A13,#REF!,68,FALSE)","v":{"$error":"#REF!"}}]
[13,{"$f":"INDEX(#REF!,MATCH(A14,#REF!,0))","v":{"$error":"#REF!"}},null,null,{"$f":"VLOOKUP(A14,#REF!,68,FALSE)","v":{"$error":"#REF!"}}]
[14,{"$f":"INDEX(#REF!,MATCH(A15,#REF!,0))","v":{"$error":"#REF!"}},"optimiza horario de operación desde 01-06-2016/ Desde 24-06-2018 opera domingo",null,{"$f":"VLOOKUP(A15,#REF!,68,FALSE)","v":{"$error":"#REF!"}}]
[15,{"$f":"INDEX(#REF!,MATCH(A16,#REF!,0))","v":{"$error":"#REF!"}},"optimiza horario de operación desde 01-06-2016",null,{"$f":"VLOOKUP(A16,#REF!,68,FALSE)","v":{"$error":"#REF!"}}]
[16,{"$f":"INDEX(#REF!,MATCH(A17,#REF!,0))","v":{"$error":"#REF!"}},"por análisis financiero desde 22-02-2016",null,{"$f":"VLOOKUP(A17,#REF!,68,FALSE)","v":{"$error":"#REF!"}},"2016-02-22"]
[17,{"$f":"INDEX(#REF!,MATCH(A18,#REF!,0))","v":{"$error":"#REF!"}},"a partir del 08-11-2010 es compartida",null,{"$f":"VLOOKUP(A18,#REF!,68,FALSE)","v":{"$error":"#REF!"}}]
[18,{"$f":"INDEX(#REF!,MATCH(A19,#REF!,0))","v":{"$error":"#REF!"}},null,null,{"$f":"VLOOKUP(A19,#REF!,68,FALSE)","v":{"$error":"#REF!"}}]
[19,{"$f":"INDEX(#REF!,MATCH(A20,#REF!,0))","v":{"$error":"#REF!"}},null,null,{"$f":"VLOOKUP(A20,#REF!,68,FALSE)","v":{"$error":"#REF!"}}]
[20,{"$f":"INDEX(#REF!,MATCH(A21,#REF!,0))","v":{"$error":"#REF!"}},"optimiza horario de operación desde 01-06-2016",null,{"$f":"VLOOKUP(A21,#REF!,68,FALSE)","v":{"$error":"#REF!"}}]
[21,{"$f":"INDEX(#REF!,MATCH(A22,#REF!,0))","v":{"$error":"#REF!"}},"a parti del 06-07-2015 - optimiza horario de operación desde 01-06-2016",null,{"$f":"VLOOKUP(A22,#REF!,68,FALSE)","v":{"$error":"#REF!"}}]
[22,{"$f":"INDEX(#REF!,MATCH(A23,#REF!,0))","v":{"$error":"#REF!"}},null,null,{"$f":"VLOOKUP(A23,#REF!,68,FALSE)","v":{"$error":"#REF!"}}]
[23,{"$f":"INDEX(#REF!,MATCH(A24,#REF!,0))","v":{"$error":"#REF!"}},"optimiza horario de operación desde 01-06-2016",null,{"$f":"VLOOKUP(A24,#REF!,68,FALSE)","v":{"$error":"#REF!"}}]
[26,{"$f":"INDEX(#REF!,MATCH(A25,#REF!,0))","v":{"$error":"#REF!"}},null,null,{"$f":"VLOOKUP(A25,#REF!,68,FALSE)","v":{"$error":"#REF!"}}]
[28,{"$f":"INDEX(#REF!,MATCH(A26,#REF!,0))","v":{"$error":"#REF!"}},"optimiza horario de operación desde 01-06-2016",null,{"$f":"VLOOKUP(A26,#REF!,68,FALSE)","v":{"$error":"#REF!"}}]
[29,{"$f":"INDEX(#REF!,MATCH(A27,#REF!,0))","v":{"$error":"#REF!"}},"según información operaciones 05,10,12 El 26-10-2013, se agrega provisoriamente 424R, por obras plaza de ciudadanía - optimiza horario de operación desde 01-06-2016",null,{"$f":"VLOOKUP(A27,#REF!,68,FALSE)","v":{"$error":"#REF!"}}]
[30,{"$f":"INDEX(#REF!,MATCH(A28,#REF!,0))","v":{"$error":"#REF!"}},"por análisis financiero desde 25-03-2016 /se abre el 01-12-2017",null,{"$f":"VLOOKUP(A28,#REF!,68,FALSE)","v":{"$error":"#REF!"}}]
[31,{"$f":"INDEX(#REF!,MATCH(A29,#REF!,0))","v":{"$error":"#REF!"}},"optimiza horario de operación desde 01-06-2016",null,{"$f":"VLOOKUP(A29,#REF!,68,FALSE)","v":{"$error":"#REF!"}}]
[32,{"$f":"INDEX(#REF!,MATCH(A30,#REF!,0))","v":{"$error":"#REF!"}},"desde el 24-06-2018 opera día domingo/ El día 12-07-2018 pasa de operar con 3 validadores a operar con 2",null,{"$f":"VLOOKUP(A30,#REF!,68,FALSE)","v":{"$error":"#REF!"}}]
{"$rows_left_out":419}
{"sheet":"Descripciòn","index":1,"n_rows":30,"n_cols":3,"rows_kept":30,"cut":false,"hidden":false,"merged":[]}
[]
["Campo","Descripción"]
["Contador","Columna auxiliar para cuantificar Zonas Pagas"]
["Código ZP","Código de la Zona Paga"]
["Patente","Codificación asignada a un validador o un grupo de validadores asignados a una Zona Paga"]
["UN Principal","Unidad de Negocio responsable de la operación de la Zona Paga."]
["UN Secundaria 1 a n","Unidad de Negocio que tiene servicios que operan en una Zona Paga Compartida, cuya operación está a cargo de otra Unidad de Negocio."]
["S1 a Sn","Servicio(s) que operan(n) en la Zonas Paga"]
["N° Validadores"," Cantidad de validadores en la Zona Paga"]
["N° Monitores","Cantidad de monitores a cargo de la Zona Paga. En base a la información proporcionada por la Unidad de Negocio a cargo de la operación."]
["X","Coordenada que indica latitud"]
["Y","Coordenada que indica longitud"]
[]
["Tipo punto","Detalle","Responsable"]
["ZP","Zona Paga","Operador"]
["ZP COMPARTIDA","Zona Paga Compartida","Operador"]
["VM","Validador Móvil","Operador"]
["ZPF","Zona Paga Fija Intermodales","Operador"]
["ZPF COMPARTIDA","Zona Paga Fija Compartida Intermodales","Operador"]
["ZPD","Zona Paga Fija Electro corredor ","Operador"]
["ZPD COMPARTIDA","Zona Paga Digital Compartida","Operador"]
["ZPD MOVIL","Zona Paga Digital Movil ","Operador"]
[]
[null,"Modoficacion en la ultima quincena ","Responsable "]
["S/OP","Sin operación dentro del periodo","Operaciones "]
["S/ES","Sin operación estallido social ","Operaciones "]
["R/OP","Reinicia operación ","Operaciones "]
["S/OP por contingencia sanitaria","Sin operación de por contingencia sanitaria ","Operaciones "]
["S/OP por servicios higenicos ","Sin operación por servicios higenicos ","Operaciones "]
["S/OP por limpieza ","Sin operación por limpieza ","Operaciones "]
{"$rows_left_out":1}
{"sheet":"ZonasPagasVigentes","index":2,"n_rows":502,"n_cols":57,"rows_kept":502,"cut":false,"hidden":false,"merged":[[0,26,0,29],[139,0,141,0],[0,18,0,21],[0,22,0,25]]}
[null,"Fecha Vigencia","2022-06-16",null,null,"|",null,null,null,null,null,"ok",null,null,null,null,null,null,"Horario Laboral",null,null,null,"Horario Sábado",null,null,null,"Horario Domingo",null,null,null,null,null,null,null,null,null,null,null,null,null,null,null,null,null,null,null,null,null,null,null,null,null,null,null,null,null,"   "]
["Contador","Estado","Tipo Punto","Código ZP","Patente","Código Parada Usuario_1","Código Parada Usuario_2","Código Parada TS_1","Código Parada TS_2","Comuna","Nombre Parada","Mixta","UN Principal","UN Secundaria 1","UN Secundaria 2","UN Secundaria 3","UN Secundaria 4","UN Secundaria 5","Inicio 1","Término 1","Inicio 2","Término 2","Inicio 1","Término 1","Inicio 2","Término 2","Inicio 1","Término 1","Inicio 2","Término 2","S1","S2","S3","S4","S5","S6","S7","S8","S9","S10","S11","S12","S13","S14","S15","S16","S17","S18","S19","S20","S21","N° Validador EXT MK Rojo","N° Monitores","Inicio de Operación","X","Y","Versión Archivo Sonda-TIC"]
[1,"Activa","ZP COMPARTIDA",1,"RM-0045","PC160","-","E-17-140-PO-7","-","LAS CONDES","Parada 4 / (M) Escuela Militar","SI","U4","U6","U5","-","-","-","06:00:00","11:00:00","-","-","-","-","-","-","-","-","-","-","406I","426I","430I","406cI","C01I","C01cI",null,null,null,null,null,null,null,null,null,null,null,null,null,null,null,5,5,"2007-02-19",352880.2,6301757.1799999997,"ZONA PAGA V268"]
[1,"Activa","ZP COMPARTIDA",2,"RM-0057","PC586","-","E-17-140-PO-10","-","LAS CONDES","Parada 3 / (M) Escuela Militar","SI","U6","U4","U5","U7","-","-","06:30:00","15:30:00","-","-","-","-","-","-","-","-","-","-","401I","407I","421I","401cI","C02R",null,null,null,null,null,null,null,null,null,null,null,null,null,null,null,null,4,4,"2007-02-20",352941.86,6301787.8399999999,"ZONA PAGA V268"]
[1,"Activa","ZP COMPARTIDA",3,"RM-0005","PC207","-","T-14-110-OP-75","-","PROVIDENCIA","Parada 2 / (M) Tobalaba","SI","U4","U7","U6","-","-","-","06:30:00","11:00:00","-","-","-","-","-","-","-","-","-","-","405I","405cR","C03R",null,null,null,null,null,null,null,null,null,null,null,null,null,null,null,null,null,null,3,3,"2007-02-26",350797.51,6301264.2400000002,"ZONA PAGA V268"]
[1,"Eliminada","ZP",4,"RM-0027","PC738","-","E-14-170-NS-5","-","PROVIDENCIA","Parada 4 / (M) Tobalaba","NO","U6","-","-","-","-","-","06:30:00","10:30:00","17:00:00","20:00:00","-","-","-","-","-","-","-","-","C06R",null,null,null,null,null,null,null,null,null,null,null,null,null,null,null,null,null,null,null,null,null,"-","2007-03-05",351150.01,6301132.9100000001,"ZONA PAGA V268"]
[1,"Eliminada","ZP",5,"RM-0009","PC290","-","T-17-145-PO-5","-","LAS CONDES","Nueva Las Condes esq. / Sn. Francisco de Asís","NO","U4","-","-","-","-","-","17:30:00","19:30:00","-","-","-","-","-","-","-","-","-","-","405R","406R","406cR","409I","426I","430I",null,null,null,null,null,null,null,null,null,null,null,null,null,null,null,null,3,"2007-03-05",358827.31,6306288.2699999996,"ZONA PAGA V268"]
[1,"Eliminada","ZP COMPARTIDA",6,"RM-0053","PC1147","-","E-14-128-PO-2","-","PROVIDENCIA","Parada 2 / Plaza Italia","SI","U4","U7","-","-","-","-","06:30:00","11:00:00","-","-","-","-","-","-","-","-","-","-","405I","405cR",null,null,null,null,null,null,null,null,null,null,null,null,null,null,null,null,null,null,null,null,3,"2007-03-05",348159,6299046,"ZONA PAGA V268"]
[1,"Suspendida ","ZP",7,"RM-0031","PC145","-","E-14-134-SN-30","-","PROVIDENCIA","Parada 3 / Plaza Italia","NO","U3","-","-","-","-","-","06:30:00","21:30:00","-","-","-","-","-","-","-","-","-","-","307I","307eR","314I","315eR",null,null,null,null,null,null,null,null,null,null,null,null,null,null,null,null,null,1,4,39146,348018.51,6299005.2400000002,"ZONA PAGA V268"]
[1,"Eliminada","ZP",8,"RM-0013","PJ112","-","E-9-53-OP-15","-","LO PRADO","Parada 7 / (M) Las Rejas","NO","U4","-","-","-","-","-","17:00:00","21:00:00","-","-","-","-","-","-","-","-","-","-","401R","405R","419R","421R","423R","413cR","431cR","106R",null,null,null,null,null,null,null,null,null,null,null,null,null,null,3,"2007-03-05",341288.61,6296688.5599999996,"ZONA PAGA V268"]
[1,"Eliminada","ZP COMPARTIDA",9,"RM-0017","PI386","-","E-13-54-SN-10","-","MAIPÚ","Parada 1 / (M) Plaza de Maipú","SI","U4","U1","U3","-","-","-","06:30:00","11:00:00","-","-","-","-","-","-","-","-","-","-","106I","110R","111R","I09I","I09cI","401I","405I","421I","413cI","413vI","431cI","431vI",null,null,null,null,null,null,null,null,null,null,3,"2007-03-05",336791.45,6290866.5499999998,"ZONA PAGA V268"]
[1,"Eliminada","ZP",10,"RM-0035","PF176","-","E-34-270-NS-70","-","PUENTE ALTO","Parada 3 / (M) Plaza de Puente Alto","NO","U7","-","-","-","-","-","15:00:00","22:30:00","-","-","-","-","-","-","-","-","-","-","F01I","F01cR","F03I","F03cI","F10R","F11R","F13R","F13cR","F14I","712R","F29I",null,null,null,null,null,null,null,null,null,null,null,4,"2007-03-05",353788.28,6280015.0499999998,"ZONA PAGA V268"]
[1,"Eliminada","ZP",11,"RM-0041","PA115","-","E-20-205-SN-65","-","SANTIAGO","Parada 6 / (M) Santa Lucía","NO","U2","-","-","-","-","-","16:00:00","21:00:00","-","-","-","-","-","-","-","-","-","-","204I","204eI",null,null,null,null,null,null,null,null,null,null,null,null,null,null,null,null,null,null,null,null,2,"2007-03-05",347012.18,6298353.4299999997,"ZONA PAGA V268"]
[1,"Activa","ZP COMPARTIDA",12,"RM-0023","PA380","-","E-20-290-OP-15","-","SANTIAGO","Parada 4 / Estación Mapocho","SI","U5","U6","-","-","-","-","13:00:00","21:00:00","-","-","11:00:00","19:00:00","-","-","-","-","-","-","408R","408eR","B20R",null,null,null,null,null,null,null,null,null,null,null,null,null,null,null,null,null,null,4,3,"2008-05-08",346484.64,6299537.6699999999,"ZONA PAGA V268"]
[1,"Activa","ZP",13,"RM-0067","PC876","-","E-17-12-SN-30","-","LAS CONDES","Parada 5 / (M) Escuela Militar","NO","U6","-","-","-","-","-","06:30:00","15:30:00","-","-","-","-","-","-","-","-","-","-","C11I","C15I","C20I",null,null,null,null,null,null,null,null,null,null,null,null,null,null,null,null,null,null,5,5,"2007-03-19",352693.84,6301656.2999999998,"ZONA PAGA V268"]
[1,"Eliminada","ZP",14,"RM-0073","PJ1587","-","L-9-29-5-PO","-","LO PRADO","Parada 4 / (M) San Pablo","NO","U5","-","-","-","-","-","06:30:00","22:00:00","-","-","-","-","-","-","-","-","-","-","J18R","J18cR",null,null,null,null,null,null,null,null,null,null,null,null,null,null,null,null,null,null,null,null,3,"2007-03-19",339895.55,6297981.7199999997,"ZONA PAGA V268"]
[1,"Activa","ZP COMPARTIDA",15,"RM-0082","PJ18","-","E-9-52-NS-20","-","LO PRADO","Parada 11 / (M) Las Rejas","SI","U4","U7","U3","-","-","-","06:30:00","11:00:00","16:00:00","20:30:00","-","-","-","-","-","-","-","-","101I","102I","107I","481I","I14R",null,null,null,null,null,null,null,null,null,null,null,null,null,null,null,null,3,3,"2007-03-19",341476.72,6296769.4800000004,"ZONA PAGA V268"]
[1,"Eliminada","ZP",16,"RM-0087","PI67","-","E-7-51-NS-15","-","ESTACIÓN CENTRAL","Parada 7 / (M) San Alberto Hurtado","NO","U1","-","-","-","-","-","16:30:00","22:00:00","-","-","-","-","-","-","-","-","-","-","105I","120I",null,null,null,null,null,null,null,null,null,null,null,null,null,null,null,null,null,null,null,null,"-","2007-03-19",342804.63,6297184.5300000003,"ZONA PAGA V268"]
[1,"Activa","ZP COMPARTIDA",17,"RM-0103","PA87","-","E-20-291-PO-10","-","SANTIAGO","Parada 7 / Estación Mapocho","SI","U2","U3","-","-","-","-","06:30:00","22:00:00","-","-","07:00:00","16:00:00","-","-","-","-","-","-","201R","214I","308R",null,null,null,null,null,null,null,null,null,null,null,null,null,null,null,null,null,null,4,4,"2007-03-19",346390.48,6299487.7000000002,"ZONA PAGA V268"]
[1,"Eliminada","ZP",18,"RM-0077","PJ96","-","L-9-7-63-PO","-","LO PRADO","Parada 5 / (M) Pajaritos","NO","U5","-","-","-","-","-","17:00:00","20:30:00","-","-","07:00:00","21:00:00","-","-","-","-","-","-","510I","516I","J06R","J11R","J12I","J17I",null,null,null,null,null,null,null,null,null,null,null,null,null,null,null,null,2,"2007-03-19",340430.44,6296729.9900000002,"ZONA PAGA V268"]
[1,"Eliminada","ZP",19,"RM-0095","PA109","-","E-20-205-SN-60","-","SANTIAGO","Parada 8 / (M) Santa Lucía","NO","U2","-","-","-","-","-","17:30:00","21:00:00","-","-","06:00:00","17:00:00","-","-","-","-","-","-","203R","208R","203eR",null,null,null,null,null,null,null,null,null,null,null,null,null,null,null,null,null,null,null,2,"2007-03-19",347000.49,6298345.4299999997,"ZONA PAGA V268"]
[1,"Activa","ZP",20,"RM-0099","PA138","-","E-20-205-SN-55","-","SANTIAGO","Parada 7 / (M) Santa Lucía","NO","U2","-","-","-","-","-","16:00:00","20:30:00","-","-","06:00:00","17:00:00","-","-","-","-","-","-","205I","209I",null,null,null,null,null,null,null,null,null,null,null,null,null,null,null,null,null,null,null,4,3,"2007-03-19",347019.32,6298319.1100000003,"ZONA PAGA V268"]
[1,"Activa","ZP COMPARTIDA",21,"RM-0109","PD451","-","E-18-157-OP-5","-","ÑUÑOA","Parada 5 / (M) Plaza Egaña","SI","U4","U2","U5","-","-","-","06:30:00","11:00:00","-","-","07:30:00","12:00:00","-","-","-","-","-","-","403R","422R","227I","D03R","D09I",null,null,null,null,null,null,null,null,null,null,null,null,null,null,null,null,3,3,"2007-03-19",353951.48,6297341.6900000004,"ZONA PAGA V268"]
[1,"Activa","ZP",22,"RM-0119","PC618","-","E-14-170-SN-10","-","PROVIDENCIA","Parada 1 / (M) Francisco Bilbao","NO","U6","-","-","-","-","-","06:00:00","15:00:00","-","-","-","-","-","-","-","-","-","-","C01I","C05R","C07R",null,null,null,null,null,null,null,null,null,null,null,null,null,null,null,null,null,null,4,4,"2007-03-26",352636.54,6299789.4800000004,"ZONA PAGA V268"]
[1,"Eliminada","ZP",23,"RM-0127","PJ149","-","E-9-71-OP-33","-","LO PRADO","Parada 7 / (M) San Pablo","NO","U4","-","-","-","-","-","17:30:00","21:00:00","-","-","07:30:00","12:00:00","-","-","-","-","-","-","402R","406R","407R","422R","426R",null,null,null,null,null,null,null,null,null,null,null,null,null,null,null,null,null,2,"2007-04-03",339764.44,6298136.2300000004,"ZONA PAGA V268"]
[1,"Eliminada","ZP COMPARTIDA",26,"RM-0225","PI470","PI400","E-7-53-PO-15","E-7-53-PO-20","ESTACIÓN CENTRAL","Parada 4 / (M) Las Rejas - Parada 3 / (M) Las Rejas","SI","U4","U5","-","-","-","-","06:00:00","10:30:00","-","-","-","-","-","-","-","-","-","-","106I","401I","404I","405I","412I","418I","419I","421I","423I","424I",null,null,null,null,null,null,null,null,null,null,null,null,4,"2007-08-24",341400.3,6296663.8899999997,"ZONA PAGA V268"]
[1,"Eliminada","ZP",28,"RM-0235","PA340","-","E-20-53-PO-90","-","SANTIAGO","Parada 9 / (M) Santa Lucía","NO","U4","-","-","-","-","-","06:30:00","11:00:00","-","-","-","-","-","-","-","-","-","-","401I","407I","412I","418I","421I",null,null,null,null,null,null,null,null,null,null,null,null,null,null,null,null,null,2,"2007-08-22",346955.88,6298376.3200000003,"ZONA PAGA V268"]
[1,"Eliminada","ZP COMPARTIDA",29,"RM-0242","PA344","-","E-20-53-OP-40","-","SANTIAGO","Parada 12 / (M) Santa Lucía","SI","U4","U3","U5","-","-","-","16:30:00","20:30:00","-","-","-","-","-","-","-","-","-","-","106R","125I","401R","405R","419R","421R","423R","424R","481I",null,null,null,null,null,null,null,null,null,null,null,null,null,2,"2007-08-24",346891.96,6298402.6900000004,"ZONA PAGA V268"]
[1,"Eliminada","ZP",30,"RM-0245","PD453","-","E-18-157-OP-45","-","ÑUÑOA","Parada 2 / Irarrázaval Macul","NO","U4","-","-","-","-","-","06:30:00","10:30:00","-","-","-","-","-","-","-","-","-","-","403R","422R",null,null,null,null,null,null,null,null,null,null,null,null,null,null,null,null,null,null,null,null,4,"2017-12-01",351578.64,6297138.3799999999,"ZONA PAGA V268"]
[1,"Suspendida ","ZP COMPARTIDA",31,"RM-0251","PI419","PI222","E-13-54-NS-85","E-13-54-NS-80","MAIPÚ","Parada 10 y 11/ (M) Plaza de Maipú","SI","U5","U3","U7","-","-","-","06:00:00","21:00:00","-","-","-","-","-","-","-","-","-","-","111I","506R","506eR","546eR","110I","106R","401R","405R","413cR","431cR","481I","506vR",null,null,null,null,null,null,null,null,null,1,3,"2007-08-23",336767.86,6290784.7300000004,"ZONA PAGA V268"]
{"$rows_left_out":472}