{"text_format":"1","workbook":"xlsx","n_sheets":6,"sheets":["Descripcion","HistoricoAdministracion","Historico","ZonasPagasVigentes"," Formulas","Cuadro Vigencia "],"not_rendered":{"charts":4,"images":0,"macros":1,"external_links":0,"defined_names":4,"comments":3,"pivot_tables":4},"unopened":[],"bounds":{"document_bytes":16777216,"sheet_cells":100000,"rows_first":2000,"rows_last":500,"rows_between":2000,"halvings":0,"cell_chars":16384,"cell_head_chars":4096},"cells_cut":0,"cells_raw":0,"read":"whole","date_system":"1900"}

{"sheet":"Descripcion","index":0,"n_rows":30,"n_cols":3,"rows_kept":30,"cut":false,"hidden":false,"merged":[]}
[]
["Campo","Descripción"]
["Contador","Columna auxiliar para cuantificar Zonas Pagas"]
["Código ZP","Código de la Zona Paga"]
["Patente","Codificación asignada a un validador o un grupo de validadores asignados a una Zona Paga"]
["UN Principal","Unidad de Negocio responsable de la operación de la Zona Paga."]
["UN Secundaria 1 a n","Unidad de Negocio que tiene servicios que operan en una Zona Paga Compartida, cuya operación está a cargo de otra Unidad de Negocio."]
["S1 a Sn","Servicio(s) que operan(n) en la Zonas Paga"]
["N° Validadores"," Cantidad de validadores en la Zona Paga"]
["N° Monitores","Cantidad de monitores a cargo de la Zona Paga. En base a la información proporcionada por la Unidad de Negocio a cargo de la operación."]
["X","Coordenada que indica latitud"]
["Y","Coordenada que indica longitud"]
[]
["Tipo punto","Detalle","Responsable"]
["ZP","Zona Paga","Operador"]
["ZP COMPARTIDA","Zona Paga Compartida","Operador"]
["VM","Validador Móvil","Operador"]
["ZPF","Zona Paga Fija Intermodales","Operador"]
["ZPF COMPARTIDA","Zona Paga Fija Compartida Intermodales","Operador"]
["ZPD","Zona Paga Fija Electro corredor ","Operador"]
{"$rows_left_out":11}
{"sheet":"HistoricoAdministracion","index":1,"n_rows":448,"n_cols":10,"rows_kept":448,"cut":false,"hidden":true,"merged":[]}
["Cod ZP","Estado ","Comentario ","Tipo de Día en que Opera","Inicio de Operación Laboral","Fin Operación Laboral","Inicio de Operación Sábado","Fin Operación Sábado","Inicio de Operación Domingo","Fin Operación Domingo"]
[1,{"$f":"INDEX(ZonasPagasVigentes!$B$2:$B$1048576,MATCH(A2,ZonasPagasVigentes!$D$2:$D$1048576,0))","v":"Activa"},"a partir del 08-11-2010 es compartida - optimiza horario de operación desde 01-06-2016",null,{"$f":"VLOOKUP(A2,ZonasPagasVigentes!$D:$BA,68,FALSE)","v":{"$error":"#REF!"}}]
[2,{"$f":"INDEX(ZonasPagasVigentes!$B$2:$B$1048576,MATCH(A3,ZonasPagasVigentes!$D$2:$D$1048576,0))","v":"Activa"},"a partir del 08-11-2010 es compartida - optimiza horario de operación desde 01-06-2016",null,{"$f":"VLOOKUP(A3,ZonasPagasVigentes!$D:$BA,68,FALSE)","v":{"$error":"#REF!"}}]
[3,{"$f":"INDEX(ZonasPagasVigentes!$B$2:$B$1048576,MATCH(A4,ZonasPagasVigentes!$D$2:$D$1048576,0))","v":"Activa"},"optimiza horario de operación desde 01-06-2016",null,{"$f":"VLOOKUP(A4,ZonasPagasVigentes!$D:$BA,68,FALSE)","v":{"$error":"#REF!"}}]
[4,{"$f":"INDEX(ZonasPagasVigentes!$B$2:$B$1048576,MATCH(A5,ZonasPagasVigentes!$D$2:$D$1048576,0))","v":"Eliminada"},"por análisis financiero desde 25-03-2016",null,{"$f":"VLOOKUP(A5,ZonasPagasVigentes!$D:$BA,68,FALSE)","v":{"$error":"#REF!"}},"2016-03-25"]
[5,{"$f":"INDEX(ZonasPagasVigentes!$B$2:$B$1048576,MATCH(A6,ZonasPagasVigentes!$D$2:$D$1048576,0))","v":"Eliminada"},"optimiza horario de operación desde 01-06-2016",null,{"$f":"VLOOKUP(A6,ZonasPagasVigentes!$D:$BA,68,FALSE)","v":{"$error":"#REF!"}}]
[6,{"$f":"INDEX(ZonasPagasVigentes!$B$2:$B$1048576,MATCH(A7,ZonasPagasVigentes!$D$2:$D$1048576,0))","v":"Eliminada"},"optimiza horario de operación desde 01-06-2016",null,{"$f":"VLOOKUP(A7,ZonasPagasVigentes!$D:$BA,68,FALSE)","v":{"$error":"#REF!"}}]
[7,{"$f":"INDEX(ZonasPagasVigentes!$B$2:$B$1048576,MATCH(A8,ZonasPagasVigentes!$D$2:$D$1048576,0))","v":"Suspendida "},null,null,{"$f":"VLOOKUP(A8,ZonasPagasVigentes!$D:$BA,68,FALSE)","v":{"$error":"#REF!"}}]
[8,{"$f":"INDEX(ZonasPagasVigentes!$B$2:$B$1048576,MATCH(A9,ZonasPagasVigentes!$D$2:$D$1048576,0))","v":"Eliminada"},"optimiza horario de operación desde 01-06-2016",null,{"$f":"VLOOKUP(A9,ZonasPagasVigentes!$D:$BA,68,FALSE)","v":{"$error":"#REF!"}}]
[9,{"$f":"INDEX(ZonasPagasVigentes!$B$2:$B$1048576,MATCH(A10,ZonasPagasVigentes!$D$2:$D$1048576,0))","v":"Eliminada"},"optimiza horario de operación desde 01-06-2016",null,{"$f":"VLOOKUP(A10,ZonasPagasVigentes!$D:$BA,68,FALSE)","v":{"$error":"#REF!"}}]
[10,{"$f":"INDEX(ZonasPagasVigentes!$B$2:$B$1048576,MATCH(A11,ZonasPagasVigentes!$D$2:$D$1048576,0))","v":"Eliminada"},"optimiza horario de operación desde 01-06-2016",null,{"$f":"VLOOKUP(A11,ZonasPagasVigentes!$D:$BA,68,FALSE)","v":{"$error":"#REF!"}}]
[11,{"$f":"INDEX(ZonasPagasVigentes!$B$2:$B$1048576,MATCH(A12,ZonasPagasVigentes!$D$2:$D$1048576,0))","v":"Eliminada"},"optimiza horario de operación desde 01-06-2016",null,{"$f":"VLOOKUP(A12,ZonasPagasVigentes!$D:$BA,68,FALSE)","v":{"$error":"#REF!"}}]
[12,{"$f":"INDEX(ZonasPagasVigentes!$B$2:$B$1048576,MATCH(A13,ZonasPagasVigentes!$D$2:$D$1048576,0))","v":"Activa"},"optimiza horario de operación desde 01-06-2016",null,{"$f":"VLOOKUP(A13,ZonasPagasVigentes!$D:$BA,68,FALSE)","v":{"$error":"#REF!"}}]
[13,{"$f":"INDEX(ZonasPagasVigentes!$B$2:$B$1048576,MATCH(A14,ZonasPagasVigentes!$D$2:$D$1048576,0))","v":"Activa"},null,null,{"$f":"VLOOKUP(A14,ZonasPagasVigentes!$D:$BA,68,FALSE)","v":{"$error":"#REF!"}}]
[14,{"$f":"INDEX(ZonasPagasVigentes!$B$2:$B$1048576,MATCH(A15,ZonasPagasVigentes!$D$2:$D$1048576,0))","v":"Eliminada"},"optimiza horario de operación desde 01-06-2016/ Desde 24-06-2018 opera domingo",null,{"$f":"VLOOKUP(A15,ZonasPagasVigentes!$D:$BA,68,FALSE)","v":{"$error":"#REF!"}}]
[15,{"$f":"INDEX(ZonasPagasVigentes!$B$2:$B$1048576,MATCH(A16,ZonasPagasVigentes!$D$2:$D$1048576,0))","v":"Activa"},"optimiza horario de operación desde 01-06-2016",null,{"$f":"VLOOKUP(A16,ZonasPagasVigentes!$D:$BA,68,FALSE)","v":{"$error":"#REF!"}}]
[16,{"$f":"INDEX(ZonasPagasVigentes!$B$2:$B$1048576,MATCH(A17,ZonasPagasVigentes!$D$2:$D$1048576,0))","v":"Eliminada"},"por análisis financiero desde 22-02-2016",null,{"$f":"VLOOKUP(A17,ZonasPagasVigentes!$D:$BA,68,FALSE)","v":{"$error":"#REF!"}},"2016-02-22"]
[17,{"$f":"INDEX(ZonasPagasVigentes!$B$2:$B$1048576,MATCH(A18,ZonasPagasVigentes!$D$2:$D$1048576,0))","v":"Activa"},"a partir del 08-11-2010 es compartida",null,{"$f":"VLOOKUP(A18,ZonasPagasVigentes!$D:$BA,68,FALSE)","v":{"$error":"#REF!"}}]
[18,{"$f":"INDEX(ZonasPagasVigentes!$B$2:$B$1048576,MATCH(A19,ZonasPagasVigentes!$D$2:$D$1048576,0))","v":"Eliminada"},null,null,{"$f":"VLOOKUP(A19,ZonasPagasVigentes!$D:$BA,68,FALSE)","v":{"$error":"#REF!"}}]
[19,{"$f":"INDEX(ZonasPagasVigentes!$B$2:$B$1048576,MATCH(A20,ZonasPagasVigentes!$D$2:$D$1048576,0))","v":"Eliminada"},null,null,{"$f":"VLOOKUP(A20,ZonasPagasVigentes!$D:$BA,68,FALSE)","v":{"$error":"#REF!"}}]
{"$rows_left_out":429}
{"sheet":"Historico","index":2,"n_rows":385,"n_cols":11,"rows_kept":385,"cut":false,"hidden":true,"merged":[]}
[]
["Tipo punto","Cod ZP","Estado ","Comentario ","Tipo de Día en que Opera","Inicio de Operación Laboral","Fin Operación Laboral","Inicio de Operación Sábado","Fin Operación Sábado","Inicio de Operación Domingo","Fin Operación Domingo"]
["ZP COMPARTIDA",1,{"$f":"INDEX(ZonasPagasVigentes!$B$2:$B$1048576,MATCH(B3,ZonasPagasVigentes!$D$2:$D$1048576,0))","v":"Activa"},"a partir del 08-11-2010 es compartida - optimiza horario de operación desde 01-06-2016",null,{"$f":"VLOOKUP(B3,ZonasPagasVigentes!$D:$BA,66,FALSE)","v":{"$error":"#REF!"}}]
["ZP COMPARTIDA",2,{"$f":"INDEX(ZonasPagasVigentes!$B$2:$B$1048576,MATCH(B4,ZonasPagasVigentes!$D$2:$D$1048576,0))","v":"Activa"},"a partir del 08-11-2010 es compartida - optimiza horario de operación desde 01-06-2016",null,{"$f":"VLOOKUP(B4,ZonasPagasVigentes!$D:$BA,66,FALSE)","v":{"$error":"#REF!"}}]
["ZP",3,{"$f":"INDEX(ZonasPagasVigentes!$B$2:$B$1048576,MATCH(B5,ZonasPagasVigentes!$D$2:$D$1048576,0))","v":"Activa"},"optimiza horario de operación desde 01-06-2016",null,{"$f":"VLOOKUP(B5,ZonasPagasVigentes!$D:$BA,66,FALSE)","v":{"$error":"#REF!"}}]
["ZP",4,{"$f":"INDEX(ZonasPagasVigentes!$B$2:$B$1048576,MATCH(B6,ZonasPagasVigentes!$D$2:$D$1048576,0))","v":"Eliminada"},"por análisis financiero desde 25-03-2016",null,{"$f":"VLOOKUP(B6,ZonasPagasVigentes!$D:$BA,66,FALSE)","v":{"$error":"#REF!"}},"2016-03-25"]
["ZP",5,{"$f":"INDEX(ZonasPagasVigentes!$B$2:$B$1048576,MATCH(B7,ZonasPagasVigentes!$D$2:$D$1048576,0))","v":"Eliminada"},"optimiza horario de operación desde 01-06-2016","Laboral",{"$f":"VLOOKUP(B7,ZonasPagasVigentes!$D:$BA,66,FALSE)","v":{"$error":"#REF!"}},"2018-08-31"]
["ZP",6,{"$f":"INDEX(ZonasPagasVigentes!$B$2:$B$1048576,MATCH(B8,ZonasPagasVigentes!$D$2:$D$1048576,0))","v":"Eliminada"},"optimiza horario de operación desde 01-06-2016",null,{"$f":"VLOOKUP(B8,ZonasPagasVigentes!$D:$BA,66,FALSE)","v":{"$error":"#REF!"}}]
["ZP",7,{"$f":"INDEX(ZonasPagasVigentes!$B$2:$B$1048576,MATCH(B9,ZonasPagasVigentes!$D$2:$D$1048576,0))","v":"Suspendida "},"Agrega 213eR y elimina 314eR PO 12-01-2019 cambia ZP a ZPM",null,{"$f":"VLOOKUP(B9,ZonasPagasVigentes!$D:$BA,66,FALSE)","v":{"$error":"#REF!"}}]
["ZP COMPARTIDA",8,{"$f":"INDEX(ZonasPagasVigentes!$B$2:$B$1048576,MATCH(B10,ZonasPagasVigentes!$D$2:$D$1048576,0))","v":"Eliminada"},"optimiza horario de operación desde 01-06-2016/ Desde 23-10-2018 deja de ser ZP Mixta porque servicio 106 pasa a express",null,{"$f":"VLOOKUP(B10,ZonasPagasVigentes!$D:$BA,66,FALSE)","v":{"$error":"#REF!"}}]
["ZP COMPARTIDA",9,{"$f":"INDEX(ZonasPagasVigentes!$B$2:$B$1048576,MATCH(B11,ZonasPagasVigentes!$D$2:$D$1048576,0))","v":"Eliminada"},"optimiza horario de operación desde 01-06-2016",null,{"$f":"VLOOKUP(B11,ZonasPagasVigentes!$D:$BA,66,FALSE)","v":{"$error":"#REF!"}},"2018-11-06"]
["ZP",10,{"$f":"INDEX(ZonasPagasVigentes!$B$2:$B$1048576,MATCH(B12,ZonasPagasVigentes!$D$2:$D$1048576,0))","v":"Eliminada"},"optimiza horario de operación desde 01-06-2016/ 31-07-2018 deja de operar y su horario es absorbido por la ZP371",null,{"$f":"VLOOKUP(B12,ZonasPagasVigentes!$D:$BA,66,FALSE)","v":{"$error":"#REF!"}},"2018-07-31"]
["ZP",11,{"$f":"INDEX(ZonasPagasVigentes!$B$2:$B$1048576,MATCH(B13,ZonasPagasVigentes!$D$2:$D$1048576,0))","v":"Eliminada"},"optimiza horario de operación desde 01-06-2016/  El 31-07-2018 deja de operar y su horario es absorbido por ZP285",null,{"$f":"VLOOKUP(B13,ZonasPagasVigentes!$D:$BA,66,FALSE)","v":{"$error":"#REF!"}},"2018-07-31"]
["ZP COMPARTIDA",12,{"$f":"INDEX(ZonasPagasVigentes!$B$2:$B$1048576,MATCH(B14,ZonasPagasVigentes!$D$2:$D$1048576,0))","v":"Activa"},"optimiza horario de operación desde 01-06-2016",null,{"$f":"VLOOKUP(B14,ZonasPagasVigentes!$D:$BA,66,FALSE)","v":{"$error":"#REF!"}}]
["ZP",13,{"$f":"INDEX(ZonasPagasVigentes!$B$2:$B$1048576,MATCH(B15,ZonasPagasVigentes!$D$2:$D$1048576,0))","v":"Activa"},null,null,{"$f":"VLOOKUP(B15,ZonasPagasVigentes!$D:$BA,66,FALSE)","v":{"$error":"#REF!"}}]
["ZP",14,{"$f":"INDEX(ZonasPagasVigentes!$B$2:$B$1048576,MATCH(B16,ZonasPagasVigentes!$D$2:$D$1048576,0))","v":"Eliminada"},"optimiza horario de operación desde 01-06-2016/ Desde 24-06-2018 opera domingo",null,{"$f":"VLOOKUP(B16,ZonasPagasVigentes!$D:$BA,66,FALSE)","v":{"$error":"#REF!"}}]
["ZP",15,{"$f":"INDEX(ZonasPagasVigentes!$B$2:$B$1048576,MATCH(B17,ZonasPagasVigentes!$D$2:$D$1048576,0))","v":"Activa"},"optimiza horario de operación desde 01-06-2016",null,{"$f":"VLOOKUP(B17,ZonasPagasVigentes!$D:$BA,66,FALSE)","v":{"$error":"#REF!"}}]
["ZP",16,{"$f":"INDEX(ZonasPagasVigentes!$B$2:$B$1048576,MATCH(B18,ZonasPagasVigentes!$D$2:$D$1048576,0))","v":"Eliminada"},"por análisis financiero desde 22-02-2016",null,{"$f":"VLOOKUP(B18,ZonasPagasVigentes!$D:$BA,66,FALSE)","v":{"$error":"#REF!"}},"2016-02-22"]
["ZP COMPARTIDA",17,{"$f":"INDEX(ZonasPagasVigentes!$B$2:$B$1048576,MATCH(B19,ZonasPagasVigentes!$D$2:$D$1048576,0))","v":"Activa"},"a partir del 08-11-2010 es compartida; elimina 201eR, 201cR y agrega 212cR PO 12-01-2019",null,{"$f":"VLOOKUP(B19,ZonasPagasVigentes!$D:$BA,66,FALSE)","v":{"$error":"#REF!"}}]
["ZP",18,{"$f":"INDEX(ZonasPagasVigentes!$B$2:$B$1048576,MATCH(B20,ZonasPagasVigentes!$D$2:$D$1048576,0))","v":"Eliminada"},"Es eliminada el 31-07-2018 y su horario es absorbido por ZP343",null,{"$f":"VLOOKUP(B20,ZonasPagasVigentes!$D:$BA,66,FALSE)","v":{"$error":"#REF!"}},"2018-07-31"]
{"$rows_left_out":366}
{"sheet":"ZonasPagasVigentes","index":3,"n_rows":489,"n_cols":56,"rows_kept":489,"cut":false,"hidden":false,"merged":[[142,0,153,0],[139,0,141,0],[0,17,0,20],[0,21,0,24],[0,25,0,28]]}
[null,"Fecha Vigencia","2021-01-31",null,null,"|",null,null,null,null,null,null,null,null,null,null,null,"Horario Laboral",null,null,null,"Horario Sábado",null,null,null,"Horario Domingo",null,null,null,null,null,null,null,null,null,null,null,null,null,null,null,null,null,null,null,null,null,null,null,null,null,null,null,null,null,"   "]
["Contador","Estado","Tipo Punto","Código ZP","Patente","Código Parada Usuario_1","Código Parada Usuario_2","Código Parada TS_1","Código Parada TS_2","Comuna","Nombre Parada","UN Principal","UN Secundaria 1","UN Secundaria 2","UN Secundaria 3","UN Secundaria 4","UN Secundaria 5","Inicio 1","Término 1","Inicio 2","Término 2","Inicio 1","Término 1","Inicio 2","Término 2","Inicio 1","Término 1","Inicio 2","Término 2","S1","S2","S3","S4","S5","S6","S7","S8","S9","S10","S11","S12","S13","S14","S15","S16","S17","S18","S19","S20","S21","N° Validador EXT MK Rojo","N° Monitores","Inicio de Operación","X","Y","Versión Archivo Sonda-TIC"]
[1,"Activa","ZP COMPARTIDA",1,"RM-0045","PC160","-","E-17-140-PO-7","-","LAS CONDES","Parada 4 / (M) Escuela Militar","U4","U6","U5","-","-","-","06:00:00","11:00:00","-","-","-","-","-","-","-","-","-","-","406I","426I","430I","406cI","C01I","C01cI",null,null,null,null,null,null,null,null,null,null,null,null,null,null,null,5,5,"2007-02-19",352880.2,6301757.1799999997,"ZONA PAGA V268"]
[1,"Activa","ZP COMPARTIDA",2,"RM-0057","PC586","-","E-17-140-PO-10","-","LAS CONDES","Parada 3 / (M) Escuela   Militar","U6","U4","U5","U7","-","-","06:30:00","15:30:00","-","-","-","-","-","-","-","-","-","-","401I","407I","421I","401cI","C02R",null,null,null,null,null,null,null,null,null,null,null,null,null,null,null,null,4,4,"2007-02-20",352941.86,6301787.8399999999,"ZONA PAGA V268"]
[1,"Activa","ZP COMPARTIDA",3,"RM-0005","PC207","-","T-14-110-OP-75","-","PROVIDENCIA","Parada 2 / (M) Tobalaba","U4","U7","U6","-","-","-","06:30:00","11:00:00","-","-","-","-","-","-","-","-","-","-","405I","405cR","C03R",null,null,null,null,null,null,null,null,null,null,null,null,null,null,null,null,null,null,3,3,"2007-02-26",350797.51,6301264.2400000002,"ZONA PAGA V268"]
[1,"Eliminada","ZP",4,"RM-0027","PC738","-","E-14-170-NS-5","-","PROVIDENCIA","Parada 4 / (M) Tobalaba","U6","-","-","-","-","-","06:30:00","10:30:00","17:00:00","20:00:00","-","-","-","-","-","-","-","-","C06R",null,null,null,null,null,null,null,null,null,null,null,null,null,null,null,null,null,null,null,null,null,"-","2007-03-05",351150.01,6301132.9100000001,"ZONA PAGA V268"]
[1,"Eliminada","ZP",5,"RM-0009","PC290","-","T-17-145-PO-5","-","LAS CONDES","Nueva Las Condes esq. / Sn. Francisco de Asís","U4","-","-","-","-","-","17:30:00","19:30:00","-","-","-","-","-","-","-","-","-","-","405R","406R","406cR","409I","426I","430I",null,null,null,null,null,null,null,null,null,null,null,null,null,null,null,null,3,"2007-03-05",358827.31,6306288.2699999996,"ZONA PAGA V268"]
[1,"Eliminada","ZP COMPARTIDA",6,"RM-0053","PC1147","-","E-14-128-PO-2","-","PROVIDENCIA","Parada 2 / Plaza Italia","U4","U7","-","-","-","-","06:30:00","11:00:00","-","-","-","-","-","-","-","-","-","-","405I","405cR",null,null,null,null,null,null,null,null,null,null,null,null,null,null,null,null,null,null,null,null,3,"2007-03-05",348159,6299046,"ZONA PAGA V268"]
[1,"Suspendida ","ZP",7,"RM-0031","PC145","-","E-14-134-SN-30","-","PROVIDENCIA","Parada 3 / Plaza Italia","U3","-","-","-","-","-","06:30:00","21:30:00","-","-","-","-","-","-","-","-","-","-","307I","307eR","314I","315eR",null,null,null,null,null,null,null,null,null,null,null,null,null,null,null,null,null,2,4,"2007-03-05",348018.51,6299005.2400000002,"ZONA PAGA V268"]
[1,"Eliminada","ZP",8,"RM-0013","PJ112","-","E-9-53-OP-15","-","LO PRADO","Parada 7 / (M) Las Rejas","U4","-","-","-","-","-","17:00:00","21:00:00","-","-","-","-","-","-","-","-","-","-","401R","405R","419R","421R","423R","413cR","431cR","106R",null,null,null,null,null,null,null,null,null,null,null,null,null,null,3,"2007-03-05",341288.61,6296688.5599999996,"ZONA PAGA V268"]
[1,"Eliminada","ZP COMPARTIDA",9,"RM-0017","PI386","-","E-13-54-SN-10","-","MAIPÚ","Parada 1 / (M) Plaza   de Maipú","U4","U1","U3","-","-","-","06:30:00","11:00:00","-","-","-","-","-","-","-","-","-","-","106I","110R","111R","I09I","I09cI","401I","405I","421I","413cI","413vI","431cI","431vI",null,null,null,null,null,null,null,null,null,null,3,"2007-03-05",336791.45,6290866.5499999998,"ZONA PAGA V268"]
[1,"Eliminada","ZP",10,"RM-0035","PF176","-","E-34-270-NS-70","-","PUENTE ALTO","Parada 3 / (M) Plaza de   Puente Alto","U7","-","-","-","-","-","15:00:00","22:30:00","-","-","-","-","-","-","-","-","-","-","F01I","F01cR","F03I","F03cI","F10R","F11R","F13R","F13cR","F14I","712R","F29I",null,null,null,null,null,null,null,null,null,null,null,4,"2007-03-05",353788.28,6280015.0499999998,"ZONA PAGA V268"]
[1,"Eliminada","ZP",11,"RM-0041","PA115","-","E-20-205-SN-65","-","SANTIAGO","Parada 6 / (M) Santa Lucía","U2","-","-","-","-","-","16:00:00","21:00:00","-","-","-","-","-","-","-","-","-","-","204I","204eI",null,null,null,null,null,null,null,null,null,null,null,null,null,null,null,null,null,null,null,null,2,"2007-03-05",347012.18,6298353.4299999997,"ZONA PAGA V268"]
[1,"Activa","ZP COMPARTIDA",12,"RM-0023","PA380","-","E-20-290-OP-15","-","SANTIAGO","Parada 4 / Estación Mapocho","U5","U6","-","-","-","-","07:00:00","20:00:00","-","-","07:00:00","20:00:00","-","-","-","-","-","-","408R","408eR","B20R",null,null,null,null,null,null,null,null,null,null,null,null,null,null,null,null,null,null,3,3,"2008-05-08",346484.64,6299537.6699999999,"ZONA PAGA V268"]
[1,"Activa","ZP",13,"RM-0067","PC876","-","E-17-12-SN-30","-","LAS CONDES","Parada 5 / (M) Escuela   Militar","U6","-","-","-","-","-","06:30:00","15:30:00","-","-","-","-","-","-","-","-","-","-","C11I","C15I","C20I",null,null,null,null,null,null,null,null,null,null,null,null,null,null,null,null,null,null,3,5,"2007-03-19",352693.84,6301656.2999999998,"ZONA PAGA V268"]
[1,"Eliminada","ZP",14,"RM-0073","PJ1587","-","L-9-29-5-PO","-","LO PRADO","Parada 4 / (M) San Pablo","U5","-","-","-","-","-","06:30:00","22:00:00","-","-","-","-","-","-","-","-","-","-","J18R","J18cR",null,null,null,null,null,null,null,null,null,null,null,null,null,null,null,null,null,null,null,null,3,"2007-03-19",339895.55,6297981.7199999997,"ZONA PAGA V268"]
[1,"Activa","ZP COMPARTIDA",15,"RM-0082","PJ18","-","E-9-52-NS-20","-","LO PRADO","Parada 11 / (M) Las Rejas","U4","U7","U3","-","-","-","06:30:00","11:00:00","16:00:00","20:30:00","-","-","-","-","-","-","-","-","101I","102I","107I","481I","I14R",null,null,null,null,null,null,null,null,null,null,null,null,null,null,null,null,2,3,"2007-03-19",341476.72,6296769.4800000004,"ZONA PAGA V268"]
[1,"Eliminada","ZP",16,"RM-0087","PI67","-","E-7-51-NS-15","-","ESTACIÓN CENTRAL","Parada 7 / (M) San   Alberto Hurtado","U1","-","-","-","-","-","16:30:00","22:00:00","-","-","-","-","-","-","-","-","-","-","105I","120I",null,null,null,null,null,null,null,null,null,null,null,null,null,null,null,null,null,null,null,null,"-","2007-03-19",342804.63,6297184.5300000003,"ZONA PAGA V268"]
[1,"Activa","ZP COMPARTIDA",17,"RM-0103","PA87","-","E-20-291-PO-10","-","SANTIAGO","Parada 7 / Estación Mapocho","U2","U3","-","-","-","-","06:30:00","22:00:00","-","-","07:00:00","16:00:00","-","-","-","-","-","-","201R","214I","308R",null,null,null,null,null,null,null,null,null,null,null,null,null,null,null,null,null,null,4,4,"2007-03-19",346390.48,6299487.7000000002,"ZONA PAGA V268"]
[1,"Eliminada","ZP",18,"RM-0077","PJ96","-","L-9-7-63-PO","-","LO PRADO","Parada 5 / (M) Pajaritos","U5","-","-","-","-","-","17:00:00","20:30:00","-","-","07:00:00","21:00:00","-","-","-","-","-","-","510I","516I","J06R","J11R","J12I","J17I",null,null,null,null,null,null,null,null,null,null,null,null,null,null,null,null,2,"2007-03-19",340430.44,6296729.9900000002,"ZONA PAGA V268"]
{"$rows_left_out":470}
{"sheet":" Formulas","index":4,"n_rows":91,"n_cols":49,"rows_kept":91,"cut":false,"hidden":true,"merged":[]}
[]
[]
[null,null,null,null,null,null,null,null,null,null,null,null,null,null,null,null,null,null,null,null,null,null,null,null,null,null,null,null,null,null,null,null,null,null,null,null,null,null,null,null,null,"Estado","Activa"]
[null,"Estado","(Todas)",null,null,null,null,null,null,null,null,null,null,null,"Comuna","Activa","Eliminada","Espera ","Suspendida ",null,"Activa","(Todas)"]
[null,null,null,null,null,null,null,null,null,null,null,null,null,null,"CERRILLOS",1,3,null,null,null,null,null,null,null,null,null,null,null,null,null,null,null,null,null,null,null,null,null,null,null,null,"Cuenta de Comuna","Etiquetas de columna"]
[null,"Unidad de Negocio"," Validadores DTPM 3G"," Validador EXT MK Rojo",null,null,null,null,null,null,null,null,null,null,"CONCHALÍ",6,1,null,null,null,"Etiquetas de fila","Suma de Suspendida ","Suma de Eliminada","Suma de Activa",null,null,null,null,null,null,null,null,null,null,null,null,null,null,null,null,null,"Comuna","U2","U3","U4","U5","U6","U7","Total general"]
[null,"U1",null,null,null,null,null,null,null,null,null,null,null,null,"EL BOSQUE",3,6,null,null,null,"CERRILLOS",null,3,1,null,null,null,null,null,null,null,null,null,null,null,null,null,null,null,null,null,"CERRILLOS",null,null,null,1,null,null,1]
[null,"U2",null,126,null,null,null,null,null,null,null,null,null,null,"ESTACIÓN CENTRAL",8,15,null,1,null,"CONCHALÍ",null,1,6,null,null,null,null,null,null,null,null,null,null,null,null,null,null,null,null,null,"CONCHALÍ",3,null,3,null,null,null,6]
[null,"U3",null,135,null,null,null,null,null,null,null,null,null,null,"HUECHURABA",2,null,null,null,null,"CONTINGENCIA",null,0,1,null,null,null,null,null,null,null,null,null,null,null,null,null,null,null,null,null,"CONTINGENCIA",null,null,null,null,1,null,1]
[null,"U4",null,61,null,null,null,null,null,null,null,null,null,null,"INDEPENDENCIA",3,1,null,6,null,"EL BOSQUE",null,6,3,null,null,null,null,null,null,null,null,null,null,null,null,null,null,null,null,null,"EL BOSQUE",1,2,null,null,null,null,3]
[null,"U5",null,114,null,null,null,null,null,null,null,null,null,null,"LA CISTERNA",24,7,null,1,null,"ESTACIÓN CENTRAL",1,15,8,null,null,null,null,null,null,null,null,null,null,null,null,null,null,null,null,null,"ESTACIÓN CENTRAL",null,3,null,3,2,null,8]
[null,"U6",null,78,null,null,null,null,null,null,null,null,null,null,"LA FLORIDA",5,6,null,1,null,"HUECHURABA",null,null,2,null,null,null,null,null,null,null,null,null,null,null,null,null,null,null,null,null,"HUECHURABA",null,null,1,null,1,null,2]
[null,"U7",null,54,null,null,null,null,null,null,null,null,null,null,"LA GRANJA",4,2,null,1,null,"INDEPENDENCIA",6,1,3,null,null,null,null,null,null,null,null,null,null,null,null,null,null,null,null,null,"INDEPENDENCIA",3,6,null,null,null,null,9]
[null,"Total general",null,568,null,null,null,null,null,null,null,null,null,null,"LA PINTANA",4,2,null,null,null,"LA CISTERNA",1,7,24,null,null,null,null,null,null,null,null,null,null,null,null,null,null,null,null,null,"LA CISTERNA",15,4,1,null,1,3,24]
[null,null,null,null,null,null,null,null,null,null,null,null,null,null,"LA REINA",1,3,null,null,null,"LA FLORIDA",1,6,5,null,null,null,null,null,null,null,null,null,null,null,null,null,null,null,null,null,"LA FLORIDA",null,5,null,null,null,null,5]
[null,null,null,null,null,null,null,null,null,null,null,null,null,null,"LAS CONDES",9,4,null,null,null,"LA GRANJA",1,2,4,null,null,null,null,null,null,null,null,null,null,null,null,null,null,null,null,null,"LA GRANJA",3,1,null,null,null,null,4]
[null,"Unidad de Negocio"," Validadores DTPM 3G"," Validador EXT MK Rojo",null,null,null,null,null,null,null,null,null,null,"LO PRADO",9,15,null,3,null,"LA PINTANA",null,2,4,null,null,null,null,null,null,null,null,null,null,null,null,null,null,null,null,null,"LA PINTANA",4,null,null,null,null,null,4]
[null,"U1",null,null,null,null,null,null,null,null,null,null,null,null,"MACUL",2,3,null,1,null,"LA REINA",null,3,1,null,null,null,null,null,null,null,null,null,null,null,null,null,null,null,null,null,"LA REINA",null,null,1,null,null,null,1]
[null,"U2",null,126,null,null,null,null,null,null,null,null,null,null,"MAIPÚ",11,4,null,4,null,"LAS CONDES",null,4,9,null,null,null,null,null,null,null,null,null,null,null,null,null,null,null,null,null,"LAS CONDES",null,null,4,null,5,null,9]
[null,"U3",null,135,null,null,null,null,null,null,null,null,null,null,"ÑUÑOA",8,9,10,8,null,"LO PRADO",3,15,9,null,null,null,null,null,null,null,null,null,null,null,null,null,null,null,null,null,"LO PRADO",null,3,1,5,null,null,9]
{"$rows_left_out":72}
{"sheet":"Cuadro Vigencia ","index":5,"n_rows":11,"n_cols":6,"rows_kept":11,"cut":false,"hidden":true,"merged":[]}
[]
["Cuenta de Estado","Etiquetas de columna"]
["Etiquetas de fila","Activa","Eliminada","Espera ","Suspendida ","Total general"]
["NA",null,118,null,null,118]
["U2",48,3,null,3,54]
["U3",41,6,null,25,72]
["U4",21,39,null,1,61]
["U5",17,30,25,22,94]
["U6",23,2,null,4,29]
["U7",23,null,null,null,23]
["Total general",173,198,25,55,451]