{"text_format":"1","workbook":"xlsx","n_sheets":6,"sheets":["Descripcion","HistoricoAdministracion","Historico","ZonasPagasVigentes"," Formulas","Cuadro Vigencia "],"not_rendered":{"charts":4,"images":0,"macros":1,"external_links":0,"defined_names":4,"comments":3,"pivot_tables":4},"unopened":[],"bounds":{"document_bytes":16777216,"sheet_cells":100000,"rows_first":2000,"rows_last":500,"rows_between":2000,"halvings":0,"cell_chars":16384,"cell_head_chars":4096},"cells_cut":0,"cells_raw":0,"read":"whole","date_system":"1900"}

{"sheet":"Descripcion","index":0,"n_rows":30,"n_cols":3,"rows_kept":30,"cut":false,"hidden":false,"merged":[]}
[]
["Campo","Descripción"]
["Contador","Columna auxiliar para cuantificar Zonas Pagas"]
["Código ZP","Código de la Zona Paga"]
["Patente","Codificación asignada a un validador o un grupo de validadores asignados a una Zona Paga"]
["UN Principal","Unidad de Negocio responsable de la operación de la Zona Paga."]
["UN Secundaria 1 a n","Unidad de Negocio que tiene servicios que operan en una Zona Paga Compartida, cuya operación está a cargo de otra Unidad de Negocio."]
["S1 a Sn","Servicio(s) que operan(n) en la Zonas Paga"]
["N° Validadores"," Cantidad de validadores en la Zona Paga"]
["N° Monitores","Cantidad de monitores a cargo de la Zona Paga. En base a la información proporcionada por la Unidad de Negocio a cargo de la operación."]
["X","Coordenada que indica latitud"]
["Y","Coordenada que indica longitud"]
[]
["Tipo punto","Detalle","Responsable"]
["ZP","Zona Paga","Operador"]
["ZP COMPARTIDA","Zona Paga Compartida","Operador"]
["VM","Validador Móvil","Operador"]
["ZPF","Zona Paga Fija Intermodales","Operador"]
["ZPF COMPARTIDA","Zona Paga Fija Compartida Intermodales","Operador"]
["ZPD","Zona Paga Fija Electro corredor ","Operador"]
["ZPD COMPARTIDA","Zona Paga Digital Compartida","Operador"]
["ZPD MOVIL","Zona Paga Digital Movil ","Operador"]
[]
[null,"Modoficacion en la ultima quincena ","Responsable "]
["S/OP","Sin operación dentro del periodo","Operaciones "]
["S/ES","Sin operación estallido social ","Operaciones "]
["R/OP","Reinicia operación ","Operaciones "]
["S/OP por contingencia sanitaria","Sin operación de por contingencia sanitaria ","Operaciones "]
["S/OP por servicios higenicos ","Sin operación por servicios higenicos ","Operaciones "]
["S/OP por limpieza ","Sin operación por limpieza ","Operaciones "]

{"sheet":"HistoricoAdministracion","index":1,"n_rows":448,"n_cols":10,"rows_kept":448,"cut":false,"hidden":true,"merged":[]}
["Cod ZP","Estado ","Comentario ","Tipo de Día en que Opera","Inicio de Operación Laboral","Fin Operación Laboral","Inicio de Operación Sábado","Fin Operación Sábado","Inicio de Operación Domingo","Fin Operación Domingo"]
[1,{"$f":"INDEX(ZonasPagasVigentes!$B$2:$B$1048576,MATCH(A2,ZonasPagasVigentes!$D$2:$D$1048576,0))","v":"Activa"},"a partir del 08-11-2010 es compartida - optimiza horario de operación desde 01-06-2016",null,{"$f":"VLOOKUP(A2,ZonasPagasVigentes!$D:$BA,68,FALSE)","v":{"$error":"#REF!"}}]
[2,{"$f":"INDEX(ZonasPagasVigentes!$B$2:$B$1048576,MATCH(A3,ZonasPagasVigentes!$D$2:$D$1048576,0))","v":"Activa"},"a partir del 08-11-2010 es compartida - optimiza horario de operación desde 01-06-2016",null,{"$f":"VLOOKUP(A3,ZonasPagasVigentes!$D:$BA,68,FALSE)","v":{"$error":"#REF!"}}]
[3,{"$f":"INDEX(ZonasPagasVigentes!$B$2:$B$1048576,MATCH(A4,ZonasPagasVigentes!$D$2:$D$1048576,0))","v":"Activa"},"optimiza horario de operación desde 01-06-2016",null,{"$f":"VLOOKUP(A4,ZonasPagasVigentes!$D:$BA,68,FALSE)","v":{"$error":"#REF!"}}]
[4,{"$f":"INDEX(ZonasPagasVigentes!$B$2:$B$1048576,MATCH(A5,ZonasPagasVigentes!$D$2:$D$1048576,0))","v":"Eliminada"},"por análisis financiero desde 25-03-2016",null,{"$f":"VLOOKUP(A5,ZonasPagasVigentes!$D:$BA,68,FALSE)","v":{"$error":"#REF!"}},"2016-03-25"]
[5,{"$f":"INDEX(ZonasPagasVigentes!$B$2:$B$1048576,MATCH(A6,ZonasPagasVigentes!$D$2:$D$1048576,0))","v":"Eliminada"},"optimiza horario de operación desde 01-06-2016",null,{"$f":"VLOOKUP(A6,ZonasPagasVigentes!$D:$BA,68,FALSE)","v":{"$error":"#REF!"}}]
[6,{"$f":"INDEX(ZonasPagasVigentes!$B$2:$B$1048576,MATCH(A7,ZonasPagasVigentes!$D$2:$D$1048576,0))","v":"Eliminada"},"optimiza horario de operación desde 01-06-2016",null,{"$f":"VLOOKUP(A7,ZonasPagasVigentes!$D:$BA,68,FALSE)","v":{"$error":"#REF!"}}]
[7,{"$f":"INDEX(ZonasPagasVigentes!$B$2:$B$1048576,MATCH(A8,ZonasPagasVigentes!$D$2:$D$1048576,0))","v":"Suspendida "},null,null,{"$f":"VLOOKUP(A8,ZonasPagasVigentes!$D:$BA,68,FALSE)","v":{"$error":"#REF!"}}]
[8,{"$f":"INDEX(ZonasPagasVigentes!$B$2:$B$1048576,MATCH(A9,ZonasPagasVigentes!$D$2:$D$1048576,0))","v":"Eliminada"},"optimiza horario de operación desde 01-06-2016",null,{"$f":"VLOOKUP(A9,ZonasPagasVigentes!$D:$BA,68,FALSE)","v":{"$error":"#REF!"}}]
[9,{"$f":"INDEX(ZonasPagasVigentes!$B$2:$B$1048576,MATCH(A10,ZonasPagasVigentes!$D$2:$D$1048576,0))","v":"Eliminada"},"optimiza horario de operación desde 01-06-2016",null,{"$f":"VLOOKUP(A10,ZonasPagasVigentes!$D:$BA,68,FALSE)","v":{"$error":"#REF!"}}]
[10,{"$f":"INDEX(ZonasPagasVigentes!$B$2:$B$1048576,MATCH(A11,ZonasPagasVigentes!$D$2:$D$1048576,0))","v":"Eliminada"},"optimiza horario de operación desde 01-06-2016",null,{"$f":"VLOOKUP(A11,ZonasPagasVigentes!$D:$BA,68,FALSE)","v":{"$error":"#REF!"}}]
[11,{"$f":"INDEX(ZonasPagasVigentes!$B$2:$B$1048576,MATCH(A12,ZonasPagasVigentes!$D$2:$D$1048576,0))","v":"Eliminada"},"optimiza horario de operación desde 01-06-2016",null,{"$f":"VLOOKUP(A12,ZonasPagasVigentes!$D:$BA,68,FALSE)","v":{"$error":"#REF!"}}]
[12,{"$f":"INDEX(ZonasPagasVigentes!$B$2:$B$1048576,MATCH(A13,ZonasPagasVigentes!$D$2:$D$1048576,0))","v":"Activa"},"optimiza horario de operación desde 01-06-2016",null,{"$f":"VLOOKUP(A13,ZonasPagasVigentes!$D:$BA,68,FALSE)","v":{"$error":"#REF!"}}]
[13,{"$f":"INDEX(ZonasPagasVigentes!$B$2:$B$1048576,MATCH(A14,ZonasPagasVigentes!$D$2:$D$1048576,0))","v":"Activa"},null,null,{"$f":"VLOOKUP(A14,ZonasPagasVigentes!$D:$BA,68,FALSE)","v":{"$error":"#REF!"}}]
[14,{"$f":"INDEX(ZonasPagasVigentes!$B$2:$B$1048576,MATCH(A15,ZonasPagasVigentes!$D$2:$D$1048576,0))","v":"Eliminada"},"optimiza horario de operación desde 01-06-2016/ Desde 24-06-2018 opera domingo",null,{"$f":"VLOOKUP(A15,ZonasPagasVigentes!$D:$BA,68,FALSE)","v":{"$error":"#REF!"}}]
[15,{"$f":"INDEX(ZonasPagasVigentes!$B$2:$B$1048576,MATCH(A16,ZonasPagasVigentes!$D$2:$D$1048576,0))","v":"Activa"},"optimiza horario de operación desde 01-06-2016",null,{"$f":"VLOOKUP(A16,ZonasPagasVigentes!$D:$BA,68,FALSE)","v":{"$error":"#REF!"}}]
[16,{"$f":"INDEX(ZonasPagasVigentes!$B$2:$B$1048576,MATCH(A17,ZonasPagasVigentes!$D$2:$D$1048576,0))","v":"Eliminada"},"por análisis financiero desde 22-02-2016",null,{"$f":"VLOOKUP(A17,ZonasPagasVigentes!$D:$BA,68,FALSE)","v":{"$error":"#REF!"}},"2016-02-22"]
[17,{"$f":"INDEX(ZonasPagasVigentes!$B$2:$B$1048576,MATCH(A18,ZonasPagasVigentes!$D$2:$D$1048576,0))","v":"Activa"},"a partir del 08-11-2010 es compartida",null,{"$f":"VLOOKUP(A18,ZonasPagasVigentes!$D:$BA,68,FALSE)","v":{"$error":"#REF!"}}]
[18,{"$f":"INDEX(ZonasPagasVigentes!$B$2:$B$1048576,MATCH(A19,ZonasPagasVigentes!$D$2:$D$1048576,0))","v":"Eliminada"},null,null,{"$f":"VLOOKUP(A19,ZonasPagasVigentes!$D:$BA,68,FALSE)","v":{"$error":"#REF!"}}]
[19,{"$f":"INDEX(ZonasPagasVigentes!$B$2:$B$1048576,MATCH(A20,ZonasPagasVigentes!$D$2:$D$1048576,0))","v":"Eliminada"},null,null,{"$f":"VLOOKUP(A20,ZonasPagasVigentes!$D:$BA,68,FALSE)","v":{"$error":"#REF!"}}]
[20,{"$f":"INDEX(ZonasPagasVigentes!$B$2:$B$1048576,MATCH(A21,ZonasPagasVigentes!$D$2:$D$1048576,0))","v":"Activa"},"optimiza horario de operación desde 01-06-2016",null,{"$f":"VLOOKUP(A21,ZonasPagasVigentes!$D:$BA,68,FALSE)","v":{"$error":"#REF!"}}]
[21,{"$f":"INDEX(ZonasPagasVigentes!$B$2:$B$1048576,MATCH(A22,ZonasPagasVigentes!$D$2:$D$1048576,0))","v":"Activa"},"a parti del 06-07-2015 - optimiza horario de operación desde 01-06-2016",null,{"$f":"VLOOKUP(A22,ZonasPagasVigentes!$D:$BA,68,FALSE)","v":{"$error":"#REF!"}}]
[22,{"$f":"INDEX(ZonasPagasVigentes!$B$2:$B$1048576,MATCH(A23,ZonasPagasVigentes!$D$2:$D$1048576,0))","v":"Activa"},null,null,{"$f":"VLOOKUP(A23,ZonasPagasVigentes!$D:$BA,68,FALSE)","v":{"$error":"#REF!"}}]
[23,{"$f":"INDEX(ZonasPagasVigentes!$B$2:$B$1048576,MATCH(A24,ZonasPagasVigentes!$D$2:$D$1048576,0))","v":"Eliminada"},"optimiza horario de operación desde 01-06-2016",null,{"$f":"VLOOKUP(A24,ZonasPagasVigentes!$D:$BA,68,FALSE)","v":{"$error":"#REF!"}}]
[26,{"$f":"INDEX(ZonasPagasVigentes!$B$2:$B$1048576,MATCH(A25,ZonasPagasVigentes!$D$2:$D$1048576,0))","v":"Eliminada"},null,null,{"$f":"VLOOKUP(A25,ZonasPagasVigentes!$D:$BA,68,FALSE)","v":{"$error":"#REF!"}}]
[28,{"$f":"INDEX(ZonasPagasVigentes!$B$2:$B$1048576,MATCH(A26,ZonasPagasVigentes!$D$2:$D$1048576,0))","v":"Eliminada"},"optimiza horario de operación desde 01-06-2016",null,{"$f":"VLOOKUP(A26,ZonasPagasVigentes!$D:$BA,68,FALSE)","v":{"$error":"#REF!"}}]
[29,{"$f":"INDEX(ZonasPagasVigentes!$B$2:$B$1048576,MATCH(A27,ZonasPagasVigentes!$D$2:$D$1048576,0))","v":"Eliminada"},"según información operaciones 05,10,12 El 26-10-2013, se agrega provisoriamente 424R, por obras plaza de ciudadanía - optimiza horario de operación desde 01-06-2016",null,{"$f":"VLOOKUP(A27,ZonasPagasVigentes!$D:$BA,68,FALSE)","v":{"$error":"#REF!"}}]
[30,{"$f":"INDEX(ZonasPagasVigentes!$B$2:$B$1048576,MATCH(A28,ZonasPagasVigentes!$D$2:$D$1048576,0))","v":"Eliminada"},"por análisis financiero desde 25-03-2016 /se abre el 01-12-2017",null,{"$f":"VLOOKUP(A28,ZonasPagasVigentes!$D:$BA,68,FALSE)","v":{"$error":"#REF!"}}]
[31,{"$f":"INDEX(ZonasPagasVigentes!$B$2:$B$1048576,MATCH(A29,ZonasPagasVigentes!$D$2:$D$1048576,0))","v":"Suspendida "},"optimiza horario de operación desde 01-06-2016",null,{"$f":"VLOOKUP(A29,ZonasPagasVigentes!$D:$BA,68,FALSE)","v":{"$error":"#REF!"}}]
[32,{"$f":"INDEX(ZonasPagasVigentes!$B$2:$B$1048576,MATCH(A30,ZonasPagasVigentes!$D$2:$D$1048576,0))","v":"Eliminada"},"desde el 24-06-2018 opera día domingo/ El día 12-07-2018 pasa de operar con 3 validadores a operar con 2",null,{"$f":"VLOOKUP(A30,ZonasPagasVigentes!$D:$BA,68,FALSE)","v":{"$error":"#REF!"}}]
[33,{"$f":"INDEX(ZonasPagasVigentes!$B$2:$B$1048576,MATCH(A31,ZonasPagasVigentes!$D$2:$D$1048576,0))","v":"Eliminada"},"optimiza horario de operación desde 01-06-2016",null,{"$f":"VLOOKUP(A31,ZonasPagasVigentes!$D:$BA,68,FALSE)","v":{"$error":"#REF!"}}]
[34,{"$f":"INDEX(ZonasPagasVigentes!$B$2:$B$1048576,MATCH(A32,ZonasPagasVigentes!$D$2:$D$1048576,0))","v":"Eliminada"},"por análisis financiero desde 22-02-2016/ vuelve a operar desde 01-12-2017",null,{"$f":"VLOOKUP(A32,ZonasPagasVigentes!$D:$BA,68,FALSE)","v":{"$error":"#REF!"}},"2016-02-22"]
[35,{"$f":"INDEX(ZonasPagasVigentes!$B$2:$B$1048576,MATCH(A33,ZonasPagasVigentes!$D$2:$D$1048576,0))","v":"Eliminada"},"optimiza horario de operación desde 01-06-2016",null,{"$f":"VLOOKUP(A33,ZonasPagasVigentes!$D:$BA,68,FALSE)","v":{"$error":"#REF!"}}]
[36,{"$f":"INDEX(ZonasPagasVigentes!$B$2:$B$1048576,MATCH(A34,ZonasPagasVigentes!$D$2:$D$1048576,0))","v":"Eliminada"},"C10e a partir del 06-01-2010 al 02-02-2015 117 a partir de 06-07-2009/ El 01-12-2017 comienza a operar en PTA",null,{"$f":"VLOOKUP(A34,ZonasPagasVigentes!$D:$BA,68,FALSE)","v":{"$error":"#REF!"}}]
[38,{"$f":"INDEX(ZonasPagasVigentes!$B$2:$B$1048576,MATCH(A35,ZonasPagasVigentes!$D$2:$D$1048576,0))","v":"Eliminada"},"desde 01-12-2015 comienza a operar como mixta porque servicio 213e pasa a U7 - optimiza horario de operación desde 01-06-2016",null,{"$f":"VLOOKUP(A35,ZonasPagasVigentes!$D:$BA,68,FALSE)","v":{"$error":"#REF!"}}]
[40,{"$f":"INDEX(ZonasPagasVigentes!$B$2:$B$1048576,MATCH(A36,ZonasPagasVigentes!$D$2:$D$1048576,0))","v":"Eliminada"},"por análisis financiero desde 25-03-2016",null,{"$f":"VLOOKUP(A36,ZonasPagasVigentes!$D:$BA,68,FALSE)","v":{"$error":"#REF!"}},"2016-03-25"]
[41,{"$f":"INDEX(ZonasPagasVigentes!$B$2:$B$1048576,MATCH(A37,ZonasPagasVigentes!$D$2:$D$1048576,0))","v":"Eliminada"},"optimiza horario de operación desde 01-06-2016/ Eliminada el 31-07-2018. Horario es absorvido por ZP284",null,{"$f":"VLOOKUP(A37,ZonasPagasVigentes!$D:$BA,68,FALSE)","v":{"$error":"#REF!"}}]
[43,{"$f":"INDEX(ZonasPagasVigentes!$B$2:$B$1048576,MATCH(A38,ZonasPagasVigentes!$D$2:$D$1048576,0))","v":"Eliminada"},"por análisis financiero desde 22-02-2016",null,{"$f":"VLOOKUP(A38,ZonasPagasVigentes!$D:$BA,68,FALSE)","v":{"$error":"#REF!"}},"2016-02-22"]
[44,{"$f":"INDEX(ZonasPagasVigentes!$B$2:$B$1048576,MATCH(A39,ZonasPagasVigentes!$D$2:$D$1048576,0))","v":"Activa"},null,null,{"$f":"VLOOKUP(A39,ZonasPagasVigentes!$D:$BA,68,FALSE)","v":{"$error":"#REF!"}}]
[45,{"$f":"INDEX(ZonasPagasVigentes!$B$2:$B$1048576,MATCH(A40,ZonasPagasVigentes!$D$2:$D$1048576,0))","v":"Activa"},null,null,{"$f":"VLOOKUP(A40,ZonasPagasVigentes!$D:$BA,68,FALSE)","v":{"$error":"#REF!"}}]
[47,{"$f":"INDEX(ZonasPagasVigentes!$B$2:$B$1048576,MATCH(A41,ZonasPagasVigentes!$D$2:$D$1048576,0))","v":"Activa"},null,null,{"$f":"VLOOKUP(A41,ZonasPagasVigentes!$D:$BA,68,FALSE)","v":{"$error":"#REF!"}}]
[48,{"$f":"INDEX(ZonasPagasVigentes!$B$2:$B$1048576,MATCH(A42,ZonasPagasVigentes!$D$2:$D$1048576,0))","v":"Eliminada"},"por análisis financiero desde 25-03-2016/ se abre el 01-12-2017",null,{"$f":"VLOOKUP(A42,ZonasPagasVigentes!$D:$BA,68,FALSE)","v":{"$error":"#REF!"}}]
[49,{"$f":"INDEX(ZonasPagasVigentes!$B$2:$B$1048576,MATCH(A43,ZonasPagasVigentes!$D$2:$D$1048576,0))","v":"Eliminada"},"desde 28,03,2014 por inclusión unidad 3. El 20,05,2014 deja operar I13 - optimiza horario de operación desde 01-06-2016",null,{"$f":"VLOOKUP(A43,ZonasPagasVigentes!$D:$BA,68,FALSE)","v":{"$error":"#REF!"}}]
[51,{"$f":"INDEX(ZonasPagasVigentes!$B$2:$B$1048576,MATCH(A44,ZonasPagasVigentes!$D$2:$D$1048576,0))","v":"Eliminada"},"por análisis financiero desde 22-02-2016",null,{"$f":"VLOOKUP(A44,ZonasPagasVigentes!$D:$BA,68,FALSE)","v":{"$error":"#REF!"}},"2016-02-22"]
[52,{"$f":"INDEX(ZonasPagasVigentes!$B$2:$B$1048576,MATCH(A45,ZonasPagasVigentes!$D$2:$D$1048576,0))","v":"Eliminada"},null,null,{"$f":"VLOOKUP(A45,ZonasPagasVigentes!$D:$BA,68,FALSE)","v":{"$error":"#REF!"}}]
[53,{"$f":"INDEX(ZonasPagasVigentes!$B$2:$B$1048576,MATCH(A46,ZonasPagasVigentes!$D$2:$D$1048576,0))","v":"Eliminada"},"Eliminada desde 01-06-2016",null,{"$f":"VLOOKUP(A46,ZonasPagasVigentes!$D:$BA,68,FALSE)","v":{"$error":"#REF!"}},"2016-07-01"]
[54,{"$f":"INDEX(ZonasPagasVigentes!$B$2:$B$1048576,MATCH(A47,ZonasPagasVigentes!$D$2:$D$1048576,0))","v":"Activa"},"optimiza horario de operación desde 01-06-2016",null,{"$f":"VLOOKUP(A47,ZonasPagasVigentes!$D:$BA,68,FALSE)","v":{"$error":"#REF!"}}]
[55,{"$f":"INDEX(ZonasPagasVigentes!$B$2:$B$1048576,MATCH(A48,ZonasPagasVigentes!$D$2:$D$1048576,0))","v":"Suspendida "},"optimiza horario de operación desde 01-06-2016",null,{"$f":"VLOOKUP(A48,ZonasPagasVigentes!$D:$BA,68,FALSE)","v":{"$error":"#REF!"}}]
[56,{"$f":"INDEX(ZonasPagasVigentes!$B$2:$B$1048576,MATCH(A49,ZonasPagasVigentes!$D$2:$D$1048576,0))","v":"Eliminada"},"Eliminada desde 01-06-2016",null,{"$f":"VLOOKUP(A49,ZonasPagasVigentes!$D:$BA,68,FALSE)","v":{"$error":"#REF!"}},"2016-07-01"]
[57,{"$f":"INDEX(ZonasPagasVigentes!$B$2:$B$1048576,MATCH(A50,ZonasPagasVigentes!$D$2:$D$1048576,0))","v":"Eliminada"},null,null,{"$f":"VLOOKUP(A50,ZonasPagasVigentes!$D:$BA,68,FALSE)","v":{"$error":"#REF!"}}]
[58,{"$f":"INDEX(ZonasPagasVigentes!$B$2:$B$1048576,MATCH(A51,ZonasPagasVigentes!$D$2:$D$1048576,0))","v":"Eliminada"},"Eliminada desde 01-06-2016",null,{"$f":"VLOOKUP(A51,ZonasPagasVigentes!$D:$BA,68,FALSE)","v":{"$error":"#REF!"}},"2016-06-01"]
[59,{"$f":"INDEX(ZonasPagasVigentes!$B$2:$B$1048576,MATCH(A52,ZonasPagasVigentes!$D$2:$D$1048576,0))","v":"Eliminada"},null,null,{"$f":"VLOOKUP(A52,ZonasPagasVigentes!$D:$BA,68,FALSE)","v":{"$error":"#REF!"}}]
[60,{"$f":"INDEX(ZonasPagasVigentes!$B$2:$B$1048576,MATCH(A53,ZonasPagasVigentes!$D$2:$D$1048576,0))","v":"Eliminada"},"optimiza horario de operación desde 01-06-2016",null,{"$f":"VLOOKUP(A53,ZonasPagasVigentes!$D:$BA,68,FALSE)","v":{"$error":"#REF!"}}]
[61,{"$f":"INDEX(ZonasPagasVigentes!$B$2:$B$1048576,MATCH(A54,ZonasPagasVigentes!$D$2:$D$1048576,0))","v":"Eliminada"},null,null,{"$f":"VLOOKUP(A54,ZonasPagasVigentes!$D:$BA,68,FALSE)","v":{"$error":"#REF!"}}]
[62,{"$f":"INDEX(ZonasPagasVigentes!$B$2:$B$1048576,MATCH(A55,ZonasPagasVigentes!$D$2:$D$1048576,0))","v":"Eliminada"},"por análisis financiero desde 22-02-2016",null,{"$f":"VLOOKUP(A55,ZonasPagasVigentes!$D:$BA,68,FALSE)","v":{"$error":"#REF!"}},"2016-02-22"]
[63,{"$f":"INDEX(ZonasPagasVigentes!$B$2:$B$1048576,MATCH(A56,ZonasPagasVigentes!$D$2:$D$1048576,0))","v":"Eliminada"},"por análisis financiero desde 25-03-2016",null,{"$f":"VLOOKUP(A56,ZonasPagasVigentes!$D:$BA,68,FALSE)","v":{"$error":"#REF!"}},"2016-03-25"]
[64,{"$f":"INDEX(ZonasPagasVigentes!$B$2:$B$1048576,MATCH(A57,ZonasPagasVigentes!$D$2:$D$1048576,0))","v":"Eliminada"},"por análisis financiero desde 22-02-2016",null,{"$f":"VLOOKUP(A57,ZonasPagasVigentes!$D:$BA,68,FALSE)","v":{"$error":"#REF!"}},"2016-02-22"]
[65,{"$f":"INDEX(ZonasPagasVigentes!$B$2:$B$1048576,MATCH(A58,ZonasPagasVigentes!$D$2:$D$1048576,0))","v":"Eliminada"},"Sin TRX deja de operar el 30-11-2015",null,{"$f":"VLOOKUP(A58,ZonasPagasVigentes!$D:$BA,68,FALSE)","v":{"$error":"#REF!"}},"2015-12-01"]
[66,{"$f":"INDEX(ZonasPagasVigentes!$B$2:$B$1048576,MATCH(A59,ZonasPagasVigentes!$D$2:$D$1048576,0))","v":"Activa"},"optimiza horario de operación desde 01-06-2016",null,{"$f":"VLOOKUP(A59,ZonasPagasVigentes!$D:$BA,68,FALSE)","v":{"$error":"#REF!"}}]
[67,{"$f":"INDEX(ZonasPagasVigentes!$B$2:$B$1048576,MATCH(A60,ZonasPagasVigentes!$D$2:$D$1048576,0))","v":"Eliminada"},"Eliminada desde 01-06-2016",null,{"$f":"VLOOKUP(A60,ZonasPagasVigentes!$D:$BA,68,FALSE)","v":{"$error":"#REF!"}},"2016-07-01"]
[68,{"$f":"INDEX(ZonasPagasVigentes!$B$2:$B$1048576,MATCH(A61,ZonasPagasVigentes!$D$2:$D$1048576,0))","v":"Eliminada"},"por análisis financiero desde 25-03-2016",null,{"$f":"VLOOKUP(A61,ZonasPagasVigentes!$D:$BA,68,FALSE)","v":{"$error":"#REF!"}},"2016-03-25"]
[69,{"$f":"INDEX(ZonasPagasVigentes!$B$2:$B$1048576,MATCH(A62,ZonasPagasVigentes!$D$2:$D$1048576,0))","v":"Eliminada"},"TEMPORALMENTE POR OBRAS A PARTIR DEL 06 DE NOVIEMBRE\nno es ZPC según información operaciones del 05,10,12\nEliminada 01-06-2016",null,{"$f":"VLOOKUP(A62,ZonasPagasVigentes!$D:$BA,68,FALSE)","v":{"$error":"#REF!"}},"2016-06-01"]
[70,{"$f":"INDEX(ZonasPagasVigentes!$B$2:$B$1048576,MATCH(A63,ZonasPagasVigentes!$D$2:$D$1048576,0))","v":"Eliminada"},"por análisis financiero desde 25-03-2016/ se abre el 01-12-2017",null,{"$f":"VLOOKUP(A63,ZonasPagasVigentes!$D:$BA,68,FALSE)","v":{"$error":"#REF!"}}]
[71,{"$f":"INDEX(ZonasPagasVigentes!$B$2:$B$1048576,MATCH(A64,ZonasPagasVigentes!$D$2:$D$1048576,0))","v":"Eliminada"},"Sin TRX",null,{"$f":"VLOOKUP(A64,ZonasPagasVigentes!$D:$BA,68,FALSE)","v":{"$error":"#REF!"}},"2011-05-23"]
[72,{"$f":"INDEX(ZonasPagasVigentes!$B$2:$B$1048576,MATCH(A65,ZonasPagasVigentes!$D$2:$D$1048576,0))","v":"Activa"},"optimiza horario de operación desde 01-06-2016",null,{"$f":"VLOOKUP(A65,ZonasPagasVigentes!$D:$BA,68,FALSE)","v":{"$error":"#REF!"}}]
[73,{"$f":"INDEX(ZonasPagasVigentes!$B$2:$B$1048576,MATCH(A66,ZonasPagasVigentes!$D$2:$D$1048576,0))","v":"Activa"},"optimiza horario de operación desde 01-06-2016",null,{"$f":"VLOOKUP(A66,ZonasPagasVigentes!$D:$BA,68,FALSE)","v":{"$error":"#REF!"}}]
[74,{"$f":"INDEX(ZonasPagasVigentes!$B$2:$B$1048576,MATCH(A67,ZonasPagasVigentes!$D$2:$D$1048576,0))","v":"Eliminada"},"según información operaciones 05,10,12\nEl 26-10-2013, se agrega provisoriamente 424R, por obras plaza de ciudadanía - optimiza horario de operación desde 01-06-2016",null,{"$f":"VLOOKUP(A67,ZonasPagasVigentes!$D:$BA,68,FALSE)","v":{"$error":"#REF!"}}]
[75,{"$f":"INDEX(ZonasPagasVigentes!$B$2:$B$1048576,MATCH(A68,ZonasPagasVigentes!$D$2:$D$1048576,0))","v":"Eliminada"},null,null,{"$f":"VLOOKUP(A68,ZonasPagasVigentes!$D:$BA,68,FALSE)","v":{"$error":"#REF!"}}]
[78,{"$f":"INDEX(ZonasPagasVigentes!$B$2:$B$1048576,MATCH(A69,ZonasPagasVigentes!$D$2:$D$1048576,0))","v":"Eliminada"},"A partir de 10-02-2010 compartida - optimiza horario de operación desde 01-06-2016",null,{"$f":"VLOOKUP(A69,ZonasPagasVigentes!$D:$BA,68,FALSE)","v":{"$error":"#REF!"}}]
[79,{"$f":"INDEX(ZonasPagasVigentes!$B$2:$B$1048576,MATCH(A70,ZonasPagasVigentes!$D$2:$D$1048576,0))","v":"Eliminada"},null,null,{"$f":"VLOOKUP(A70,ZonasPagasVigentes!$D:$BA,68,FALSE)","v":{"$error":"#REF!"}}]
[80,{"$f":"INDEX(ZonasPagasVigentes!$B$2:$B$1048576,MATCH(A71,ZonasPagasVigentes!$D$2:$D$1048576,0))","v":"Eliminada"},"por análisis financiero desde 25-03-2016",null,{"$f":"VLOOKUP(A71,ZonasPagasVigentes!$D:$BA,68,FALSE)","v":{"$error":"#REF!"}},"2016-03-25"]
[82,{"$f":"INDEX(ZonasPagasVigentes!$B$2:$B$1048576,MATCH(A72,ZonasPagasVigentes!$D$2:$D$1048576,0))","v":"Eliminada"},"Eliminada desde 01-06-2016",null,{"$f":"VLOOKUP(A72,ZonasPagasVigentes!$D:$BA,68,FALSE)","v":{"$error":"#REF!"}},"2016-07-01"]
[83,{"$f":"INDEX(ZonasPagasVigentes!$B$2:$B$1048576,MATCH(A73,ZonasPagasVigentes!$D$2:$D$1048576,0))","v":"Activa"},"optimiza horario de operación desde 01-06-2016",null,{"$f":"VLOOKUP(A73,ZonasPagasVigentes!$D:$BA,68,FALSE)","v":{"$error":"#REF!"}}]
[85,{"$f":"INDEX(ZonasPagasVigentes!$B$2:$B$1048576,MATCH(A74,ZonasPagasVigentes!$D$2:$D$1048576,0))","v":"Eliminada"},"Sin TRX",null,{"$f":"VLOOKUP(A74,ZonasPagasVigentes!$D:$BA,68,FALSE)","v":{"$error":"#REF!"}},"2011-05-23"]
[86,{"$f":"INDEX(ZonasPagasVigentes!$B$2:$B$1048576,MATCH(A75,ZonasPagasVigentes!$D$2:$D$1048576,0))","v":"Eliminada"},"Sin TRX deja de operar el 30-11-2015",null,{"$f":"VLOOKUP(A75,ZonasPagasVigentes!$D:$BA,68,FALSE)","v":{"$error":"#REF!"}},"2015-12-01"]
[87,{"$f":"INDEX(ZonasPagasVigentes!$B$2:$B$1048576,MATCH(A76,ZonasPagasVigentes!$D$2:$D$1048576,0))","v":"Activa"},null,null,{"$f":"VLOOKUP(A76,ZonasPagasVigentes!$D:$BA,68,FALSE)","v":{"$error":"#REF!"}}]
[90,{"$f":"INDEX(ZonasPagasVigentes!$B$2:$B$1048576,MATCH(A77,ZonasPagasVigentes!$D$2:$D$1048576,0))","v":"Activa"},"A partir 12,01,2013 a partir del 04-10-2013 deja de operar 517\nA partir del 07-09-2015, se vuelve mixta sin estar oficializada en Consolidado de Paradas\noptimiza horario de operación desde 01-06-2016/ El 01-12-2017 comienza a operar en PTA",null,{"$f":"VLOOKUP(A77,ZonasPagasVigentes!$D:$BA,68,FALSE)","v":{"$error":"#REF!"}}]
[91,{"$f":"INDEX(ZonasPagasVigentes!$B$2:$B$1048576,MATCH(A78,ZonasPagasVigentes!$D$2:$D$1048576,0))","v":"Activa"},null,null,{"$f":"VLOOKUP(A78,ZonasPagasVigentes!$D:$BA,68,FALSE)","v":{"$error":"#REF!"}}]
[93,{"$f":"INDEX(ZonasPagasVigentes!$B$2:$B$1048576,MATCH(A79,ZonasPagasVigentes!$D$2:$D$1048576,0))","v":"Eliminada"},"por análisis financiero desde 25-03-2016",null,{"$f":"VLOOKUP(A79,ZonasPagasVigentes!$D:$BA,68,FALSE)","v":{"$error":"#REF!"}},"2016-03-25"]
[94,{"$f":"INDEX(ZonasPagasVigentes!$B$2:$B$1048576,MATCH(A80,ZonasPagasVigentes!$D$2:$D$1048576,0))","v":"Suspendida "},null,null,{"$f":"VLOOKUP(A80,ZonasPagasVigentes!$D:$BA,68,FALSE)","v":{"$error":"#REF!"}}]
[96,{"$f":"INDEX(ZonasPagasVigentes!$B$2:$B$1048576,MATCH(A81,ZonasPagasVigentes!$D$2:$D$1048576,0))","v":"Eliminada"},"optimiza horario de operación desde 01-06-2016",null,{"$f":"VLOOKUP(A81,ZonasPagasVigentes!$D:$BA,68,FALSE)","v":{"$error":"#REF!"}}]
[97,{"$f":"INDEX(ZonasPagasVigentes!$B$2:$B$1048576,MATCH(A82,ZonasPagasVigentes!$D$2:$D$1048576,0))","v":"Eliminada"},"por análisis financiero desde 22-02-2016",null,{"$f":"VLOOKUP(A82,ZonasPagasVigentes!$D:$BA,68,FALSE)","v":{"$error":"#REF!"}},"2016-02-22"]
[98,{"$f":"INDEX(ZonasPagasVigentes!$B$2:$B$1048576,MATCH(A83,ZonasPagasVigentes!$D$2:$D$1048576,0))","v":"Eliminada"},"a partir 05-10-2013 empieza operar H05c - optimiza horario de operación desde 01-06-2016",null,{"$f":"VLOOKUP(A83,ZonasPagasVigentes!$D:$BA,68,FALSE)","v":{"$error":"#REF!"}}]
[99,{"$f":"INDEX(ZonasPagasVigentes!$B$2:$B$1048576,MATCH(A84,ZonasPagasVigentes!$D$2:$D$1048576,0))","v":"Eliminada"},"por análisis financiero desde 22-02-2016",null,{"$f":"VLOOKUP(A84,ZonasPagasVigentes!$D:$BA,68,FALSE)","v":{"$error":"#REF!"}},"2016-02-22"]
[101,{"$f":"INDEX(ZonasPagasVigentes!$B$2:$B$1048576,MATCH(A85,ZonasPagasVigentes!$D$2:$D$1048576,0))","v":"Eliminada"},"por análisis financiero desde 22-02-2016",null,{"$f":"VLOOKUP(A85,ZonasPagasVigentes!$D:$BA,68,FALSE)","v":{"$error":"#REF!"}},"2016-02-22"]
[102,{"$f":"INDEX(ZonasPagasVigentes!$B$2:$B$1048576,MATCH(A86,ZonasPagasVigentes!$D$2:$D$1048576,0))","v":"Activa"},null,null,{"$f":"VLOOKUP(A86,ZonasPagasVigentes!$D:$BA,68,FALSE)","v":{"$error":"#REF!"}}]
[105,{"$f":"INDEX(ZonasPagasVigentes!$B$2:$B$1048576,MATCH(A87,ZonasPagasVigentes!$D$2:$D$1048576,0))","v":"Eliminada"},"por análisis financiero desde 22-02-2016",null,{"$f":"VLOOKUP(A87,ZonasPagasVigentes!$D:$BA,68,FALSE)","v":{"$error":"#REF!"}},"2016-02-22"]
[106,{"$f":"INDEX(ZonasPagasVigentes!$B$2:$B$1048576,MATCH(A88,ZonasPagasVigentes!$D$2:$D$1048576,0))","v":"Eliminada"},"por análisis financiero desde 22-02-2016",null,{"$f":"VLOOKUP(A88,ZonasPagasVigentes!$D:$BA,68,FALSE)","v":{"$error":"#REF!"}},"2016-02-22"]
[108,{"$f":"INDEX(ZonasPagasVigentes!$B$2:$B$1048576,MATCH(A89,ZonasPagasVigentes!$D$2:$D$1048576,0))","v":"Activa"},"optimiza horario de operación desde 01-06-2016",null,{"$f":"VLOOKUP(A89,ZonasPagasVigentes!$D:$BA,68,FALSE)","v":{"$error":"#REF!"}}]
[109,{"$f":"INDEX(ZonasPagasVigentes!$B$2:$B$1048576,MATCH(A90,ZonasPagasVigentes!$D$2:$D$1048576,0))","v":"Eliminada"},"Sin TRX",null,{"$f":"VLOOKUP(A90,ZonasPagasVigentes!$D:$BA,68,FALSE)","v":{"$error":"#REF!"}},"2011-05-23"]
[110,{"$f":"INDEX(ZonasPagasVigentes!$B$2:$B$1048576,MATCH(A91,ZonasPagasVigentes!$D$2:$D$1048576,0))","v":"Eliminada"},"Inicio operaciones 12-11-2013",null,{"$f":"VLOOKUP(A91,ZonasPagasVigentes!$D:$BA,68,FALSE)","v":{"$error":"#REF!"}}]
[111,{"$f":"INDEX(ZonasPagasVigentes!$B$2:$B$1048576,MATCH(A92,ZonasPagasVigentes!$D$2:$D$1048576,0))","v":"Eliminada"},"Inicio operaciones 12-11-2013",null,{"$f":"VLOOKUP(A92,ZonasPagasVigentes!$D:$BA,68,FALSE)","v":{"$error":"#REF!"}}]
[112,{"$f":"INDEX(ZonasPagasVigentes!$B$2:$B$1048576,MATCH(A93,ZonasPagasVigentes!$D$2:$D$1048576,0))","v":"Activa"},"optimiza horario de operación desde 01-06-2016",null,{"$f":"VLOOKUP(A93,ZonasPagasVigentes!$D:$BA,68,FALSE)","v":{"$error":"#REF!"}}]
[115,{"$f":"INDEX(ZonasPagasVigentes!$B$2:$B$1048576,MATCH(A94,ZonasPagasVigentes!$D$2:$D$1048576,0))","v":"Eliminada"},"Eliminada 01-06-2016",null,{"$f":"VLOOKUP(A94,ZonasPagasVigentes!$D:$BA,68,FALSE)","v":{"$error":"#REF!"}},"2016-06-01"]
[116,{"$f":"INDEX(ZonasPagasVigentes!$B$2:$B$1048576,MATCH(A95,ZonasPagasVigentes!$D$2:$D$1048576,0))","v":"Eliminada"},"optimiza horario de operación desde 01-06-2016 - desde 02-07-2016 opera como ZPM agrega B27",null,{"$f":"VLOOKUP(A95,ZonasPagasVigentes!$D:$BA,68,FALSE)","v":{"$error":"#REF!"}}]
[117,{"$f":"INDEX(ZonasPagasVigentes!$B$2:$B$1048576,MATCH(A96,ZonasPagasVigentes!$D$2:$D$1048576,0))","v":"Eliminada"},"se retiran 2 validadores el 21-12-2011",null,{"$f":"VLOOKUP(A96,ZonasPagasVigentes!$D:$BA,68,FALSE)","v":{"$error":"#REF!"}},"2017-10-06"]
[118,{"$f":"INDEX(ZonasPagasVigentes!$B$2:$B$1048576,MATCH(A97,ZonasPagasVigentes!$D$2:$D$1048576,0))","v":"Activa"},null,null,{"$f":"VLOOKUP(A97,ZonasPagasVigentes!$D:$BA,68,FALSE)","v":{"$error":"#REF!"}}]
[119,{"$f":"INDEX(ZonasPagasVigentes!$B$2:$B$1048576,MATCH(A98,ZonasPagasVigentes!$D$2:$D$1048576,0))","v":"Activa"},null,null,{"$f":"VLOOKUP(A98,ZonasPagasVigentes!$D:$BA,68,FALSE)","v":{"$error":"#REF!"}}]
[120,{"$f":"INDEX(ZonasPagasVigentes!$B$2:$B$1048576,MATCH(A99,ZonasPagasVigentes!$D$2:$D$1048576,0))","v":"Eliminada"},"se convierte en mixta el 18-01-2014",null,{"$f":"VLOOKUP(A99,ZonasPagasVigentes!$D:$BA,68,FALSE)","v":{"$error":"#REF!"}}]
[121,{"$f":"INDEX(ZonasPagasVigentes!$B$2:$B$1048576,MATCH(A100,ZonasPagasVigentes!$D$2:$D$1048576,0))","v":"Eliminada"},"optimiza horario de operación desde 01-06-2016",null,{"$f":"VLOOKUP(A100,ZonasPagasVigentes!$D:$BA,68,FALSE)","v":{"$error":"#REF!"}}]
[122,{"$f":"INDEX(ZonasPagasVigentes!$B$2:$B$1048576,MATCH(A101,ZonasPagasVigentes!$D$2:$D$1048576,0))","v":"Suspendida "},null,null,{"$f":"VLOOKUP(A101,ZonasPagasVigentes!$D:$BA,68,FALSE)","v":{"$error":"#REF!"}}]
[124,{"$f":"INDEX(ZonasPagasVigentes!$B$2:$B$1048576,MATCH(A102,ZonasPagasVigentes!$D$2:$D$1048576,0))","v":"Eliminada"},"por análisis financiero desde 25-03-2016",null,{"$f":"VLOOKUP(A102,ZonasPagasVigentes!$D:$BA,68,FALSE)","v":{"$error":"#REF!"}},"2016-03-25"]
[127,{"$f":"INDEX(ZonasPagasVigentes!$B$2:$B$1048576,MATCH(A103,ZonasPagasVigentes!$D$2:$D$1048576,0))","v":"Eliminada"},null,null,{"$f":"VLOOKUP(A103,ZonasPagasVigentes!$D:$BA,68,FALSE)","v":{"$error":"#REF!"}}]
[136,{"$f":"INDEX(ZonasPagasVigentes!$B$2:$B$1048576,MATCH(A104,ZonasPagasVigentes!$D$2:$D$1048576,0))","v":"Activa"},"Desde 02 de Julio cambia cód de parada ya que se traslada por modificación de trazado 303e",null,{"$f":"VLOOKUP(A104,ZonasPagasVigentes!$D:$BA,68,FALSE)","v":{"$error":"#REF!"}}]
[144,{"$f":"INDEX(ZonasPagasVigentes!$B$2:$B$1048576,MATCH(A105,ZonasPagasVigentes!$D$2:$D$1048576,0))","v":"Eliminada"},"Sin TRX por descoordinación con Infraestructura, Constructora la sacó",null,{"$f":"VLOOKUP(A105,ZonasPagasVigentes!$D:$BA,68,FALSE)","v":{"$error":"#REF!"}},"2015-12-01"]
[146,{"$f":"INDEX(ZonasPagasVigentes!$B$2:$B$1048576,MATCH(A106,ZonasPagasVigentes!$D$2:$D$1048576,0))","v":"Eliminada"},"Sin TRX deja de operar el 30-09-2013",null,{"$f":"VLOOKUP(A106,ZonasPagasVigentes!$D:$BA,68,FALSE)","v":{"$error":"#REF!"}},"2013-10-25"]
[147,{"$f":"INDEX(ZonasPagasVigentes!$B$2:$B$1048576,MATCH(A107,ZonasPagasVigentes!$D$2:$D$1048576,0))","v":"Eliminada"},"optimiza horario de operación desde 01-06-2016",null,{"$f":"VLOOKUP(A107,ZonasPagasVigentes!$D:$BA,68,FALSE)","v":{"$error":"#REF!"}}]
[148,{"$f":"INDEX(ZonasPagasVigentes!$B$2:$B$1048576,MATCH(A108,ZonasPagasVigentes!$D$2:$D$1048576,0))","v":"Eliminada"},"Sin TRX",null,{"$f":"VLOOKUP(A108,ZonasPagasVigentes!$D:$BA,68,FALSE)","v":{"$error":"#REF!"}},"2011-05-23"]
[149,{"$f":"INDEX(ZonasPagasVigentes!$B$2:$B$1048576,MATCH(A109,ZonasPagasVigentes!$D$2:$D$1048576,0))","v":"Eliminada"},"optimiza horario de operación desde 01-06-2016",null,{"$f":"VLOOKUP(A109,ZonasPagasVigentes!$D:$BA,68,FALSE)","v":{"$error":"#REF!"}}]
[153,{"$f":"INDEX(ZonasPagasVigentes!$B$2:$B$1048576,MATCH(A110,ZonasPagasVigentes!$D$2:$D$1048576,0))","v":"Eliminada"},"optimiza horario de operación desde 01-06-2016",null,{"$f":"VLOOKUP(A110,ZonasPagasVigentes!$D:$BA,68,FALSE)","v":{"$error":"#REF!"}}]
[155,{"$f":"INDEX(ZonasPagasVigentes!$B$2:$B$1048576,MATCH(A111,ZonasPagasVigentes!$D$2:$D$1048576,0))","v":"Eliminada"},"por análisis financiero desde 25-03-2016",null,{"$f":"VLOOKUP(A111,ZonasPagasVigentes!$D:$BA,68,FALSE)","v":{"$error":"#REF!"}},"2016-03-25"]
[157,{"$f":"INDEX(ZonasPagasVigentes!$B$2:$B$1048576,MATCH(A112,ZonasPagasVigentes!$D$2:$D$1048576,0))","v":"Eliminada"},"por análisis financiero desde 22-02-2016",null,{"$f":"VLOOKUP(A112,ZonasPagasVigentes!$D:$BA,68,FALSE)","v":{"$error":"#REF!"}},"2016-02-22"]
[159,{"$f":"INDEX(ZonasPagasVigentes!$B$2:$B$1048576,MATCH(A113,ZonasPagasVigentes!$D$2:$D$1048576,0))","v":"Eliminada"},"por análisis financiero desde 25-03-2016",null,{"$f":"VLOOKUP(A113,ZonasPagasVigentes!$D:$BA,68,FALSE)","v":{"$error":"#REF!"}},"2016-03-25"]
[162,{"$f":"INDEX(ZonasPagasVigentes!$B$2:$B$1048576,MATCH(A114,ZonasPagasVigentes!$D$2:$D$1048576,0))","v":"Eliminada"},"desde 01-06-2016 Operada por U2",null,{"$f":"VLOOKUP(A114,ZonasPagasVigentes!$D:$BA,68,FALSE)","v":{"$error":"#REF!"}},"2016-06-01"]
[164,{"$f":"INDEX(ZonasPagasVigentes!$B$2:$B$1048576,MATCH(A115,ZonasPagasVigentes!$D$2:$D$1048576,0))","v":"Eliminada"},"optimiza horario de operación desde 01-06-2016",null,{"$f":"VLOOKUP(A115,ZonasPagasVigentes!$D:$BA,68,FALSE)","v":{"$error":"#REF!"}}]
[165,{"$f":"INDEX(ZonasPagasVigentes!$B$2:$B$1048576,MATCH(A116,ZonasPagasVigentes!$D$2:$D$1048576,0))","v":"Eliminada"},"desde 01-06-2016 Operada por U2",null,{"$f":"VLOOKUP(A116,ZonasPagasVigentes!$D:$BA,68,FALSE)","v":{"$error":"#REF!"}},"2016-06-01"]
[166,{"$f":"INDEX(ZonasPagasVigentes!$B$2:$B$1048576,MATCH(A117,ZonasPagasVigentes!$D$2:$D$1048576,0))","v":"Activa"},null,null,{"$f":"VLOOKUP(A117,ZonasPagasVigentes!$D:$BA,68,FALSE)","v":{"$error":"#REF!"}}]
[168,{"$f":"INDEX(ZonasPagasVigentes!$B$2:$B$1048576,MATCH(A118,ZonasPagasVigentes!$D$2:$D$1048576,0))","v":"Eliminada"},"optimiza horario de operación desde 01-06-2016/ El 7 de Julio se agregan 211cr, 201er,211r,201r",null,{"$f":"VLOOKUP(A118,ZonasPagasVigentes!$D:$BA,68,FALSE)","v":{"$error":"#REF!"}}]
[170,{"$f":"INDEX(ZonasPagasVigentes!$B$2:$B$1048576,MATCH(A119,ZonasPagasVigentes!$D$2:$D$1048576,0))","v":"Eliminada"},"desde 01-06-2016 Operada por U2",null,{"$f":"VLOOKUP(A119,ZonasPagasVigentes!$D:$BA,68,FALSE)","v":{"$error":"#REF!"}},"2016-06-01"]
[172,{"$f":"INDEX(ZonasPagasVigentes!$B$2:$B$1048576,MATCH(A120,ZonasPagasVigentes!$D$2:$D$1048576,0))","v":"Eliminada"},"Eliminada 05-12-2016 por cambio de Servicio 416e a 546e",null,{"$f":"VLOOKUP(A120,ZonasPagasVigentes!$D:$BA,68,FALSE)","v":{"$error":"#REF!"}},"2016-12-09"]
[173,{"$f":"INDEX(ZonasPagasVigentes!$B$2:$B$1048576,MATCH(A121,ZonasPagasVigentes!$D$2:$D$1048576,0))","v":"Eliminada"},"Se convierte en una Zona Paga con 172 a partir del 01-06-2016",null,{"$f":"VLOOKUP(A121,ZonasPagasVigentes!$D:$BA,68,FALSE)","v":{"$error":"#REF!"}},"2016-06-01"]
[178,{"$f":"INDEX(ZonasPagasVigentes!$B$2:$B$1048576,MATCH(A122,ZonasPagasVigentes!$D$2:$D$1048576,0))","v":"Activa"},"desde 01-06-2016 Operada por U2",null,{"$f":"VLOOKUP(A122,ZonasPagasVigentes!$D:$BA,68,FALSE)","v":{"$error":"#REF!"}},"2016-06-01"]
[179,{"$f":"INDEX(ZonasPagasVigentes!$B$2:$B$1048576,MATCH(A123,ZonasPagasVigentes!$D$2:$D$1048576,0))","v":"Eliminada"},"desde 01-06-2016 Operada por U2",null,{"$f":"VLOOKUP(A123,ZonasPagasVigentes!$D:$BA,68,FALSE)","v":{"$error":"#REF!"}},"2016-06-01"]
[183,{"$f":"INDEX(ZonasPagasVigentes!$B$2:$B$1048576,MATCH(A124,ZonasPagasVigentes!$D$2:$D$1048576,0))","v":"Eliminada"},"optimiza horario de operación desde 01-06-2016",null,{"$f":"VLOOKUP(A124,ZonasPagasVigentes!$D:$BA,68,FALSE)","v":{"$error":"#REF!"}},"2016-07-01"]
[185,{"$f":"INDEX(ZonasPagasVigentes!$B$2:$B$1048576,MATCH(A125,ZonasPagasVigentes!$D$2:$D$1048576,0))","v":"Activa"},"Inicio de operación: 07-01-2010 - optimiza horario de operación desde 01-06-2016",null,{"$f":"VLOOKUP(A125,ZonasPagasVigentes!$D:$BA,68,FALSE)","v":{"$error":"#REF!"}}]
[186,{"$f":"INDEX(ZonasPagasVigentes!$B$2:$B$1048576,MATCH(A126,ZonasPagasVigentes!$D$2:$D$1048576,0))","v":"Activa"},"Inicio de operación: 07-01-2010",null,{"$f":"VLOOKUP(A126,ZonasPagasVigentes!$D:$BA,68,FALSE)","v":{"$error":"#REF!"}}]
[187,{"$f":"INDEX(ZonasPagasVigentes!$B$2:$B$1048576,MATCH(A127,ZonasPagasVigentes!$D$2:$D$1048576,0))","v":"Activa"},null,null,{"$f":"VLOOKUP(A127,ZonasPagasVigentes!$D:$BA,68,FALSE)","v":{"$error":"#REF!"}}]
[188,{"$f":"INDEX(ZonasPagasVigentes!$B$2:$B$1048576,MATCH(A128,ZonasPagasVigentes!$D$2:$D$1048576,0))","v":"Activa"},null,null,{"$f":"VLOOKUP(A128,ZonasPagasVigentes!$D:$BA,68,FALSE)","v":{"$error":"#REF!"}}]
[189,{"$f":"INDEX(ZonasPagasVigentes!$B$2:$B$1048576,MATCH(A129,ZonasPagasVigentes!$D$2:$D$1048576,0))","v":"Eliminada"},"Compartida a partir plan 06,10,12\nVuelve a ZP a partir 27,07,2013\ndesde 01-06-2016 Operada por U5",null,{"$f":"VLOOKUP(A129,ZonasPagasVigentes!$D:$BA,68,FALSE)","v":{"$error":"#REF!"}},"2016-06-01"]
[190,{"$f":"INDEX(ZonasPagasVigentes!$B$2:$B$1048576,MATCH(A130,ZonasPagasVigentes!$D$2:$D$1048576,0))","v":"Eliminada"},"optimiza horario de operación desde 01-06-2016",null,{"$f":"VLOOKUP(A130,ZonasPagasVigentes!$D:$BA,68,FALSE)","v":{"$error":"#REF!"}}]
[191,{"$f":"INDEX(ZonasPagasVigentes!$B$2:$B$1048576,MATCH(A131,ZonasPagasVigentes!$D$2:$D$1048576,0))","v":"Eliminada"},"Inicio operación: 05-12-2011",null,{"$f":"VLOOKUP(A131,ZonasPagasVigentes!$D:$BA,68,FALSE)","v":{"$error":"#REF!"}}]
[192,{"$f":"INDEX(ZonasPagasVigentes!$B$2:$B$1048576,MATCH(A132,ZonasPagasVigentes!$D$2:$D$1048576,0))","v":"Eliminada"},"Inicio operación: 05-12-2011\nEl 26-10-2013, se eliminan servicios 229, 301 y 301e, por obras plaza de ciudadanía. Se normaliza 13,03,2014",null,{"$f":"VLOOKUP(A132,ZonasPagasVigentes!$D:$BA,68,FALSE)","v":{"$error":"#REF!"}}]
[193,{"$f":"INDEX(ZonasPagasVigentes!$B$2:$B$1048576,MATCH(A133,ZonasPagasVigentes!$D$2:$D$1048576,0))","v":"Activa"},"Inicio de operación 02-01-2012 -  optimiza horario de operación desde 01-06-2016 - El 21-02-18 se eliminan 4 servicios de la ZP( 105,109,120 y B09) y se reubican en parada nueva",null,{"$f":"VLOOKUP(A133,ZonasPagasVigentes!$D:$BA,68,FALSE)","v":{"$error":"#REF!"}}]
[194,{"$f":"INDEX(ZonasPagasVigentes!$B$2:$B$1048576,MATCH(A134,ZonasPagasVigentes!$D$2:$D$1048576,0))","v":"Activa"},"Inicio de operación 02-01-2012/ El 01-12-2017 comienza a operar en PMA también",null,{"$f":"VLOOKUP(A134,ZonasPagasVigentes!$D:$BA,68,FALSE)","v":{"$error":"#REF!"}}]
[195,{"$f":"INDEX(ZonasPagasVigentes!$B$2:$B$1048576,MATCH(A135,ZonasPagasVigentes!$D$2:$D$1048576,0))","v":"Eliminada"},"se instalan 2 validadores el 22-12-2011, en la parada EIM BELLAVISTA DE LA FLORIDA.Comparten fisicamente el mismo lugar que ZPF 117\n",null,{"$f":"VLOOKUP(A135,ZonasPagasVigentes!$D:$BA,68,FALSE)","v":{"$error":"#REF!"}},"2017-10-06"]
[196,{"$f":"INDEX(ZonasPagasVigentes!$B$2:$B$1048576,MATCH(A136,ZonasPagasVigentes!$D$2:$D$1048576,0))","v":"Eliminada"},"Sin TRX",null,{"$f":"VLOOKUP(A136,ZonasPagasVigentes!$D:$BA,68,FALSE)","v":{"$error":"#REF!"}},"2012-03-02"]
[197,{"$f":"INDEX(ZonasPagasVigentes!$B$2:$B$1048576,MATCH(A137,ZonasPagasVigentes!$D$2:$D$1048576,0))","v":"Eliminada"},"Sin TRX",null,{"$f":"VLOOKUP(A137,ZonasPagasVigentes!$D:$BA,68,FALSE)","v":{"$error":"#REF!"}},"2012-03-02"]
[198,{"$f":"INDEX(ZonasPagasVigentes!$B$2:$B$1048576,MATCH(A138,ZonasPagasVigentes!$D$2:$D$1048576,0))","v":"Eliminada"},"Sin TRX",null,{"$f":"VLOOKUP(A138,ZonasPagasVigentes!$D:$BA,68,FALSE)","v":{"$error":"#REF!"}},"2012-03-02"]
[199,{"$f":"INDEX(ZonasPagasVigentes!$B$2:$B$1048576,MATCH(A139,ZonasPagasVigentes!$D$2:$D$1048576,0))","v":"Activa"},"Inicia operación 27-05-2013 - operada por U7",null,{"$f":"VLOOKUP(A139,ZonasPagasVigentes!$D:$BA,68,FALSE)","v":{"$error":"#REF!"}}]
[200,{"$f":"INDEX(ZonasPagasVigentes!$B$2:$B$1048576,MATCH(A140,ZonasPagasVigentes!$D$2:$D$1048576,0))","v":"Activa"},"Inicia operación 27-05-2013 - operada por U7",null,{"$f":"VLOOKUP(A140,ZonasPagasVigentes!$D:$BA,68,FALSE)","v":{"$error":"#REF!"}}]
[201,{"$f":"INDEX(ZonasPagasVigentes!$B$2:$B$1048576,MATCH(A141,ZonasPagasVigentes!$D$2:$D$1048576,0))","v":"Activa"},"Inicia operación 27-05-2013 - operada por U7",null,{"$f":"VLOOKUP(A141,ZonasPagasVigentes!$D:$BA,68,FALSE)","v":{"$error":"#REF!"}}]
[202,{"$f":"INDEX(ZonasPagasVigentes!$B$2:$B$1048576,MATCH(A142,ZonasPagasVigentes!$D$2:$D$1048576,0))","v":"Activa"},"Inicia operación 17-09-2013 /desde 15-01-2015 -  Operada por U2",null,{"$f":"VLOOKUP(A142,ZonasPagasVigentes!$D:$BA,68,FALSE)","v":{"$error":"#REF!"}}]
[203,{"$f":"INDEX(ZonasPagasVigentes!$B$2:$B$1048576,MATCH(A143,ZonasPagasVigentes!$D$2:$D$1048576,0))","v":"Activa"},"Inicia operación 17-09-2013 /desde 15-01-2015 -  Operada por U2",null,{"$f":"VLOOKUP(A143,ZonasPagasVigentes!$D:$BA,68,FALSE)","v":{"$error":"#REF!"}}]
[204,{"$f":"INDEX(ZonasPagasVigentes!$B$2:$B$1048576,MATCH(A144,ZonasPagasVigentes!$D$2:$D$1048576,0))","v":"Eliminada"},"Sin TRX fue provisoria",null,null,"2014-01-31"]
[205,{"$f":"INDEX(ZonasPagasVigentes!$B$2:$B$1048576,MATCH(A145,ZonasPagasVigentes!$D$2:$D$1048576,0))","v":"Eliminada"},"Sin TRX fue provisoria",null,{"$f":"VLOOKUP(A145,ZonasPagasVigentes!$D:$BA,68,FALSE)","v":{"$error":"#REF!"}},"2014-02-28"]
[206,{"$f":"INDEX(ZonasPagasVigentes!$B$2:$B$1048576,MATCH(A146,ZonasPagasVigentes!$D$2:$D$1048576,0))","v":"Eliminada"},"Sin TRX fue provisoria hasta el 09-01-2014",null,null,"2014-01-10"]
[207,{"$f":"INDEX(ZonasPagasVigentes!$B$2:$B$1048576,MATCH(A147,ZonasPagasVigentes!$D$2:$D$1048576,0))","v":"Eliminada"},"Sin TRX fue provisoria hasta el 09-01-2014",null,{"$f":"VLOOKUP(A147,ZonasPagasVigentes!$D:$BA,68,FALSE)","v":{"$error":"#REF!"}},"2014-01-31"]
[208,{"$f":"INDEX(ZonasPagasVigentes!$B$2:$B$1048576,MATCH(A148,ZonasPagasVigentes!$D$2:$D$1048576,0))","v":"Activa"},"Inicia operación 17-02-2014 / desde 15-01-2015 -  Operada por U2",null,{"$f":"VLOOKUP(A148,ZonasPagasVigentes!$D:$BA,68,FALSE)","v":{"$error":"#REF!"}}]
[209,{"$f":"INDEX(ZonasPagasVigentes!$B$2:$B$1048576,MATCH(A149,ZonasPagasVigentes!$D$2:$D$1048576,0))","v":"Activa"},"Inicia operación 17-02-2014 / desde 15-01-2015 -  Operada por U2",null,{"$f":"VLOOKUP(A149,ZonasPagasVigentes!$D:$BA,68,FALSE)","v":{"$error":"#REF!"}}]
[210,{"$f":"INDEX(ZonasPagasVigentes!$B$2:$B$1048576,MATCH(A150,ZonasPagasVigentes!$D$2:$D$1048576,0))","v":"Eliminada"},"Sin TRX eliminada el 03-03-2015 - desde 01-06-2016 Operada por U2",null,{"$f":"VLOOKUP(A150,ZonasPagasVigentes!$D:$BA,68,FALSE)","v":{"$error":"#REF!"}},"2015-03-03"]
[211,{"$f":"INDEX(ZonasPagasVigentes!$B$2:$B$1048576,MATCH(A151,ZonasPagasVigentes!$D$2:$D$1048576,0))","v":"Activa"},"Inicia operación 17-02-2014 / desde 15-01-2015 -  Operada por U2",null,{"$f":"VLOOKUP(A151,ZonasPagasVigentes!$D:$BA,68,FALSE)","v":{"$error":"#REF!"}}]
[212,{"$f":"INDEX(ZonasPagasVigentes!$B$2:$B$1048576,MATCH(A152,ZonasPagasVigentes!$D$2:$D$1048576,0))","v":"Activa"},"Inicia operación 17-02-2014 / desde 15-01-2015 -  Operada por U2",null,{"$f":"VLOOKUP(A152,ZonasPagasVigentes!$D:$BA,68,FALSE)","v":{"$error":"#REF!"}}]
[213,{"$f":"INDEX(ZonasPagasVigentes!$B$2:$B$1048576,MATCH(A153,ZonasPagasVigentes!$D$2:$D$1048576,0))","v":"Activa"},"Inicia operación 17-02-2014 / desde 15-01-2015 -  Operada por U2",null,{"$f":"VLOOKUP(A153,ZonasPagasVigentes!$D:$BA,68,FALSE)","v":{"$error":"#REF!"}},"2015-01-16"]
[214,{"$f":"INDEX(ZonasPagasVigentes!$B$2:$B$1048576,MATCH(A154,ZonasPagasVigentes!$D$2:$D$1048576,0))","v":"Activa"},null,null,{"$f":"VLOOKUP(A154,ZonasPagasVigentes!$D:$BA,68,FALSE)","v":{"$error":"#REF!"}}]
[215,{"$f":"INDEX(ZonasPagasVigentes!$B$2:$B$1048576,MATCH(A155,ZonasPagasVigentes!$D$2:$D$1048576,0))","v":"Activa"},null,null,{"$f":"VLOOKUP(A155,ZonasPagasVigentes!$D:$BA,68,FALSE)","v":{"$error":"#REF!"}}]
[216,{"$f":"INDEX(ZonasPagasVigentes!$B$2:$B$1048576,MATCH(A156,ZonasPagasVigentes!$D$2:$D$1048576,0))","v":"Activa"},null,null,{"$f":"VLOOKUP(A156,ZonasPagasVigentes!$D:$BA,68,FALSE)","v":{"$error":"#REF!"}}]
[217,{"$f":"INDEX(ZonasPagasVigentes!$B$2:$B$1048576,MATCH(A157,ZonasPagasVigentes!$D$2:$D$1048576,0))","v":"Activa"},null,null,{"$f":"VLOOKUP(A157,ZonasPagasVigentes!$D:$BA,68,FALSE)","v":{"$error":"#REF!"}}]
[218,{"$f":"INDEX(ZonasPagasVigentes!$B$2:$B$1048576,MATCH(A158,ZonasPagasVigentes!$D$2:$D$1048576,0))","v":"Activa"},null,null,{"$f":"VLOOKUP(A158,ZonasPagasVigentes!$D:$BA,68,FALSE)","v":{"$error":"#REF!"}}]
[219,{"$f":"INDEX(ZonasPagasVigentes!$B$2:$B$1048576,MATCH(A159,ZonasPagasVigentes!$D$2:$D$1048576,0))","v":"Eliminada"},"Se elimina el 04-09-2017 (Se fusionan dos paradas y forman ZP 353)",null,{"$f":"VLOOKUP(A159,ZonasPagasVigentes!$D:$BA,68,FALSE)","v":{"$error":"#REF!"}},"2017-09-14"]
[220,{"$f":"INDEX(ZonasPagasVigentes!$B$2:$B$1048576,MATCH(A160,ZonasPagasVigentes!$D$2:$D$1048576,0))","v":"Activa"},null,null,{"$f":"VLOOKUP(A160,ZonasPagasVigentes!$D:$BA,68,FALSE)","v":{"$error":"#REF!"}}]
[221,{"$f":"INDEX(ZonasPagasVigentes!$B$2:$B$1048576,MATCH(A161,ZonasPagasVigentes!$D$2:$D$1048576,0))","v":"Activa"},null,null,{"$f":"VLOOKUP(A161,ZonasPagasVigentes!$D:$BA,68,FALSE)","v":{"$error":"#REF!"}}]
[222,{"$f":"INDEX(ZonasPagasVigentes!$B$2:$B$1048576,MATCH(A162,ZonasPagasVigentes!$D$2:$D$1048576,0))","v":"Activa"},null,null,{"$f":"VLOOKUP(A162,ZonasPagasVigentes!$D:$BA,68,FALSE)","v":{"$error":"#REF!"}}]
[223,{"$f":"INDEX(ZonasPagasVigentes!$B$2:$B$1048576,MATCH(A163,ZonasPagasVigentes!$D$2:$D$1048576,0))","v":"Activa"},null,null,{"$f":"VLOOKUP(A163,ZonasPagasVigentes!$D:$BA,68,FALSE)","v":{"$error":"#REF!"}}]
[224,{"$f":"INDEX(ZonasPagasVigentes!$B$2:$B$1048576,MATCH(A164,ZonasPagasVigentes!$D$2:$D$1048576,0))","v":"Activa"},null,null,{"$f":"VLOOKUP(A164,ZonasPagasVigentes!$D:$BA,68,FALSE)","v":{"$error":"#REF!"}}]
[225,{"$f":"INDEX(ZonasPagasVigentes!$B$2:$B$1048576,MATCH(A165,ZonasPagasVigentes!$D$2:$D$1048576,0))","v":"Activa"},null,null,{"$f":"VLOOKUP(A165,ZonasPagasVigentes!$D:$BA,68,FALSE)","v":{"$error":"#REF!"}}]
[226,{"$f":"INDEX(ZonasPagasVigentes!$B$2:$B$1048576,MATCH(A166,ZonasPagasVigentes!$D$2:$D$1048576,0))","v":"Activa"},null,null,{"$f":"VLOOKUP(A166,ZonasPagasVigentes!$D:$BA,68,FALSE)","v":{"$error":"#REF!"}}]
[227,{"$f":"INDEX(ZonasPagasVigentes!$B$2:$B$1048576,MATCH(A167,ZonasPagasVigentes!$D$2:$D$1048576,0))","v":"Activa"},null,null,{"$f":"VLOOKUP(A167,ZonasPagasVigentes!$D:$BA,68,FALSE)","v":{"$error":"#REF!"}}]
[228,{"$f":"INDEX(ZonasPagasVigentes!$B$2:$B$1048576,MATCH(A168,ZonasPagasVigentes!$D$2:$D$1048576,0))","v":"Activa"},null,null,{"$f":"VLOOKUP(A168,ZonasPagasVigentes!$D:$BA,68,FALSE)","v":{"$error":"#REF!"}}]
[229,{"$f":"INDEX(ZonasPagasVigentes!$B$2:$B$1048576,MATCH(A169,ZonasPagasVigentes!$D$2:$D$1048576,0))","v":"Activa"},null,null,{"$f":"VLOOKUP(A169,ZonasPagasVigentes!$D:$BA,68,FALSE)","v":{"$error":"#REF!"}}]
[230,{"$f":"INDEX(ZonasPagasVigentes!$B$2:$B$1048576,MATCH(A170,ZonasPagasVigentes!$D$2:$D$1048576,0))","v":"Eliminada"},"Sin TRX eliminada piloto hasta 09-12-2014",null,{"$f":"VLOOKUP(A170,ZonasPagasVigentes!$D:$BA,68,FALSE)","v":{"$error":"#REF!"}},"2014-12-19"]
[231,{"$f":"INDEX(ZonasPagasVigentes!$B$2:$B$1048576,MATCH(A171,ZonasPagasVigentes!$D$2:$D$1048576,0))","v":"Activa"},null,null,{"$f":"VLOOKUP(A171,ZonasPagasVigentes!$D:$BA,68,FALSE)","v":{"$error":"#REF!"}}]
[232,{"$f":"INDEX(ZonasPagasVigentes!$B$2:$B$1048576,MATCH(A172,ZonasPagasVigentes!$D$2:$D$1048576,0))","v":"Activa"},null,null,{"$f":"VLOOKUP(A172,ZonasPagasVigentes!$D:$BA,68,FALSE)","v":{"$error":"#REF!"}}]
[233,{"$f":"INDEX(ZonasPagasVigentes!$B$2:$B$1048576,MATCH(A173,ZonasPagasVigentes!$D$2:$D$1048576,0))","v":"Activa"},null,null,{"$f":"VLOOKUP(A173,ZonasPagasVigentes!$D:$BA,68,FALSE)","v":{"$error":"#REF!"}}]
[234,{"$f":"INDEX(ZonasPagasVigentes!$B$2:$B$1048576,MATCH(A174,ZonasPagasVigentes!$D$2:$D$1048576,0))","v":"Activa"},null,null,{"$f":"VLOOKUP(A174,ZonasPagasVigentes!$D:$BA,68,FALSE)","v":{"$error":"#REF!"}}]
[235,{"$f":"INDEX(ZonasPagasVigentes!$B$2:$B$1048576,MATCH(A175,ZonasPagasVigentes!$D$2:$D$1048576,0))","v":"Eliminada"},"Sin TRX eliminada piloto hasta 09-12-2014",null,{"$f":"VLOOKUP(A175,ZonasPagasVigentes!$D:$BA,68,FALSE)","v":{"$error":"#REF!"}},"2014-12-09"]
[236,{"$f":"INDEX(ZonasPagasVigentes!$B$2:$B$1048576,MATCH(A176,ZonasPagasVigentes!$D$2:$D$1048576,0))","v":"Activa"},null,null,{"$f":"VLOOKUP(A176,ZonasPagasVigentes!$D:$BA,68,FALSE)","v":{"$error":"#REF!"}}]
[237,{"$f":"INDEX(ZonasPagasVigentes!$B$2:$B$1048576,MATCH(A177,ZonasPagasVigentes!$D$2:$D$1048576,0))","v":"Activa"},null,null,{"$f":"VLOOKUP(A177,ZonasPagasVigentes!$D:$BA,68,FALSE)","v":{"$error":"#REF!"}}]
[238,{"$f":"INDEX(ZonasPagasVigentes!$B$2:$B$1048576,MATCH(A178,ZonasPagasVigentes!$D$2:$D$1048576,0))","v":"Activa"},null,null,{"$f":"VLOOKUP(A178,ZonasPagasVigentes!$D:$BA,68,FALSE)","v":{"$error":"#REF!"}}]
[239,{"$f":"INDEX(ZonasPagasVigentes!$B$2:$B$1048576,MATCH(A179,ZonasPagasVigentes!$D$2:$D$1048576,0))","v":"Activa"},null,null,{"$f":"VLOOKUP(A179,ZonasPagasVigentes!$D:$BA,68,FALSE)","v":{"$error":"#REF!"}}]
[240,{"$f":"INDEX(ZonasPagasVigentes!$B$2:$B$1048576,MATCH(A180,ZonasPagasVigentes!$D$2:$D$1048576,0))","v":"Eliminada"},null,null,{"$f":"VLOOKUP(A180,ZonasPagasVigentes!$D:$BA,68,FALSE)","v":{"$error":"#REF!"}}]
[241,{"$f":"INDEX(ZonasPagasVigentes!$B$2:$B$1048576,MATCH(A181,ZonasPagasVigentes!$D$2:$D$1048576,0))","v":"Activa"},"desde 01-06-2016 Operada por U2",null,{"$f":"VLOOKUP(A181,ZonasPagasVigentes!$D:$BA,68,FALSE)","v":{"$error":"#REF!"}}]
[242,{"$f":"INDEX(ZonasPagasVigentes!$B$2:$B$1048576,MATCH(A182,ZonasPagasVigentes!$D$2:$D$1048576,0))","v":"Activa"},"desde 01-06-2016 Operada por U2",null,{"$f":"VLOOKUP(A182,ZonasPagasVigentes!$D:$BA,68,FALSE)","v":{"$error":"#REF!"}}]
[243,{"$f":"INDEX(ZonasPagasVigentes!$B$2:$B$1048576,MATCH(A183,ZonasPagasVigentes!$D$2:$D$1048576,0))","v":"Activa"},null,null,{"$f":"VLOOKUP(A183,ZonasPagasVigentes!$D:$BA,68,FALSE)","v":{"$error":"#REF!"}}]
[244,{"$f":"INDEX(ZonasPagasVigentes!$B$2:$B$1048576,MATCH(A184,ZonasPagasVigentes!$D$2:$D$1048576,0))","v":"Eliminada"},"Sin TRX eliminada piloto hasta 09-12-2014",null,{"$f":"VLOOKUP(A184,ZonasPagasVigentes!$D:$BA,68,FALSE)","v":{"$error":"#REF!"}},"2014-12-09"]
[245,{"$f":"INDEX(ZonasPagasVigentes!$B$2:$B$1048576,MATCH(A185,ZonasPagasVigentes!$D$2:$D$1048576,0))","v":"Activa"},"inicia 15-01-2015",null,{"$f":"VLOOKUP(A185,ZonasPagasVigentes!$D:$BA,68,FALSE)","v":{"$error":"#REF!"}}]
[246,{"$f":"INDEX(ZonasPagasVigentes!$B$2:$B$1048576,MATCH(A186,ZonasPagasVigentes!$D$2:$D$1048576,0))","v":"Activa"},"inicia 15-01-2015 / Desde martes 29-08-2017 opera entre las 15:00 y 21:00 hrs",null,{"$f":"VLOOKUP(A186,ZonasPagasVigentes!$D:$BA,68,FALSE)","v":{"$error":"#REF!"}}]
[247,{"$f":"INDEX(ZonasPagasVigentes!$B$2:$B$1048576,MATCH(A187,ZonasPagasVigentes!$D$2:$D$1048576,0))","v":"Activa"},"inicia 15-01-2015 / Desde martes 29-08-2017 opera entre las 15:00 y 21:00 hrs",null,{"$f":"VLOOKUP(A187,ZonasPagasVigentes!$D:$BA,68,FALSE)","v":{"$error":"#REF!"}}]
[248,{"$f":"INDEX(ZonasPagasVigentes!$B$2:$B$1048576,MATCH(A188,ZonasPagasVigentes!$D$2:$D$1048576,0))","v":"Activa"},"inicia 15-01-2015 / Desde martes 29-08-2017 opera entre las 15:00 y 21:00 hrs",null,{"$f":"VLOOKUP(A188,ZonasPagasVigentes!$D:$BA,68,FALSE)","v":{"$error":"#REF!"}}]
[249,{"$f":"INDEX(ZonasPagasVigentes!$B$2:$B$1048576,MATCH(A189,ZonasPagasVigentes!$D$2:$D$1048576,0))","v":"Activa"},"inicia 15-01-2015/ El 7 de Julio de 2018 se eliminan 201r, 201er, 211cr, 211r",null,{"$f":"VLOOKUP(A189,ZonasPagasVigentes!$D:$BA,68,FALSE)","v":{"$error":"#REF!"}}]
[250,{"$f":"INDEX(ZonasPagasVigentes!$B$2:$B$1048576,MATCH(A190,ZonasPagasVigentes!$D$2:$D$1048576,0))","v":"Activa"},"inicia 15-01-2015/ El 7 de Julio de 2018 se eliminan 201r, 211cr, 211r",null,{"$f":"VLOOKUP(A190,ZonasPagasVigentes!$D:$BA,68,FALSE)","v":{"$error":"#REF!"}}]
[251,{"$f":"INDEX(ZonasPagasVigentes!$B$2:$B$1048576,MATCH(A191,ZonasPagasVigentes!$D$2:$D$1048576,0))","v":"Eliminada"},"inicia 15-01-2015/ El 7 de Julio de 2018 se incorpor el servicio G14I",null,{"$f":"VLOOKUP(A191,ZonasPagasVigentes!$D:$BA,68,FALSE)","v":{"$error":"#REF!"}}]
[252,{"$f":"INDEX(ZonasPagasVigentes!$B$2:$B$1048576,MATCH(A192,ZonasPagasVigentes!$D$2:$D$1048576,0))","v":"Eliminada"},null,null,{"$f":"VLOOKUP(A192,ZonasPagasVigentes!$D:$BA,68,FALSE)","v":{"$error":"#REF!"}}]
[253,{"$f":"INDEX(ZonasPagasVigentes!$B$2:$B$1048576,MATCH(A193,ZonasPagasVigentes!$D$2:$D$1048576,0))","v":"Eliminada"},null,null,{"$f":"VLOOKUP(A193,ZonasPagasVigentes!$D:$BA,68,FALSE)","v":{"$error":"#REF!"}}]
[255,{"$f":"INDEX(ZonasPagasVigentes!$B$2:$B$1048576,MATCH(A194,ZonasPagasVigentes!$D$2:$D$1048576,0))","v":"Activa"},"Eliminada 01-04-2016 / Reabrió  22-05-2017",null,{"$f":"VLOOKUP(A194,ZonasPagasVigentes!$D:$BA,68,FALSE)","v":{"$error":"#REF!"}}]
[256,{"$f":"INDEX(ZonasPagasVigentes!$B$2:$B$1048576,MATCH(A195,ZonasPagasVigentes!$D$2:$D$1048576,0))","v":"Eliminada"},"Eliminada 01-04-2016 / Reabrió  22-05-2017",null,{"$f":"VLOOKUP(A195,ZonasPagasVigentes!$D:$BA,68,FALSE)","v":{"$error":"#REF!"}}]
[257,{"$f":"INDEX(ZonasPagasVigentes!$B$2:$B$1048576,MATCH(A196,ZonasPagasVigentes!$D$2:$D$1048576,0))","v":"Activa"},"24-06-2018 modifica horario de domingo (pasa de 12:00-20:00 a 11:00-19:00) ",null,{"$f":"VLOOKUP(A196,ZonasPagasVigentes!$D:$BA,68,FALSE)","v":{"$error":"#REF!"}}]
[258,{"$f":"INDEX(ZonasPagasVigentes!$B$2:$B$1048576,MATCH(A197,ZonasPagasVigentes!$D$2:$D$1048576,0))","v":"Eliminada"},"Inicia 07-03-2016 / Eliminada 05-07-2017",null,{"$f":"VLOOKUP(A197,ZonasPagasVigentes!$D:$BA,68,FALSE)","v":{"$error":"#REF!"}},"2017-07-05"]
[259,{"$f":"INDEX(ZonasPagasVigentes!$B$2:$B$1048576,MATCH(A198,ZonasPagasVigentes!$D$2:$D$1048576,0))","v":"Eliminada"},"Comienza en PMA el 11-10-2016",null,{"$f":"VLOOKUP(A198,ZonasPagasVigentes!$D:$BA,68,FALSE)","v":{"$error":"#REF!"}}]
[260,{"$f":"INDEX(ZonasPagasVigentes!$B$2:$B$1048576,MATCH(A199,ZonasPagasVigentes!$D$2:$D$1048576,0))","v":"Eliminada"},"Comienza en PMA el 11-10-2016/ se supende operación el miércoles 14 de febrero debido a trabajos viales en eje compañía, vuelve a operar 03-03-18",null,{"$f":"VLOOKUP(A199,ZonasPagasVigentes!$D:$BA,68,FALSE)","v":{"$error":"#REF!"}}]
[261,{"$f":"INDEX(ZonasPagasVigentes!$B$2:$B$1048576,MATCH(A200,ZonasPagasVigentes!$D$2:$D$1048576,0))","v":"Eliminada"},"Comienza en PMA el 11-10-2016",null,{"$f":"VLOOKUP(A200,ZonasPagasVigentes!$D:$BA,68,FALSE)","v":{"$error":"#REF!"}}]
[262,{"$f":"INDEX(ZonasPagasVigentes!$B$2:$B$1048576,MATCH(A201,ZonasPagasVigentes!$D$2:$D$1048576,0))","v":"Activa"},null,null,{"$f":"VLOOKUP(A201,ZonasPagasVigentes!$D:$BA,68,FALSE)","v":{"$error":"#REF!"}}]
[263,{"$f":"INDEX(ZonasPagasVigentes!$B$2:$B$1048576,MATCH(A202,ZonasPagasVigentes!$D$2:$D$1048576,0))","v":"Activa"},null,null,{"$f":"VLOOKUP(A202,ZonasPagasVigentes!$D:$BA,68,FALSE)","v":{"$error":"#REF!"}}]
[264,{"$f":"INDEX(ZonasPagasVigentes!$B$2:$B$1048576,MATCH(A203,ZonasPagasVigentes!$D$2:$D$1048576,0))","v":"Activa"},null,null,{"$f":"VLOOKUP(A203,ZonasPagasVigentes!$D:$BA,68,FALSE)","v":{"$error":"#REF!"}}]
[265,{"$f":"INDEX(ZonasPagasVigentes!$B$2:$B$1048576,MATCH(A204,ZonasPagasVigentes!$D$2:$D$1048576,0))","v":"Activa"},null,null,{"$f":"VLOOKUP(A204,ZonasPagasVigentes!$D:$BA,68,FALSE)","v":{"$error":"#REF!"}}]
[266,{"$f":"INDEX(ZonasPagasVigentes!$B$2:$B$1048576,MATCH(A205,ZonasPagasVigentes!$D$2:$D$1048576,0))","v":"Activa"},null,null,{"$f":"VLOOKUP(A205,ZonasPagasVigentes!$D:$BA,68,FALSE)","v":{"$error":"#REF!"}}]
[267,{"$f":"INDEX(ZonasPagasVigentes!$B$2:$B$1048576,MATCH(A206,ZonasPagasVigentes!$D$2:$D$1048576,0))","v":"Activa"},null,null,{"$f":"VLOOKUP(A206,ZonasPagasVigentes!$D:$BA,68,FALSE)","v":{"$error":"#REF!"}}]
[268,{"$f":"INDEX(ZonasPagasVigentes!$B$2:$B$1048576,MATCH(A207,ZonasPagasVigentes!$D$2:$D$1048576,0))","v":"Activa"},"En el PO de Julio de 2017, se eliminó el servicio 218e",null,{"$f":"VLOOKUP(A207,ZonasPagasVigentes!$D:$BA,68,FALSE)","v":{"$error":"#REF!"}}]
[269,{"$f":"INDEX(ZonasPagasVigentes!$B$2:$B$1048576,MATCH(A208,ZonasPagasVigentes!$D$2:$D$1048576,0))","v":"Activa"},null,null,{"$f":"VLOOKUP(A208,ZonasPagasVigentes!$D:$BA,68,FALSE)","v":{"$error":"#REF!"}}]
[270,{"$f":"INDEX(ZonasPagasVigentes!$B$2:$B$1048576,MATCH(A209,ZonasPagasVigentes!$D$2:$D$1048576,0))","v":"Suspendida "},null,null,{"$f":"VLOOKUP(A209,ZonasPagasVigentes!$D:$BA,68,FALSE)","v":{"$error":"#REF!"}}]
[271,{"$f":"INDEX(ZonasPagasVigentes!$B$2:$B$1048576,MATCH(A210,ZonasPagasVigentes!$D$2:$D$1048576,0))","v":"Suspendida "},"inicia 27-06-2016, comienza en PMA el 17-10-2016",null,{"$f":"VLOOKUP(A210,ZonasPagasVigentes!$D:$BA,68,FALSE)","v":{"$error":"#REF!"}}]
[272,{"$f":"INDEX(ZonasPagasVigentes!$B$2:$B$1048576,MATCH(A211,ZonasPagasVigentes!$D$2:$D$1048576,0))","v":"Activa"},"inicia 27-06-2016",null,{"$f":"VLOOKUP(A211,ZonasPagasVigentes!$D:$BA,68,FALSE)","v":{"$error":"#REF!"}}]
[273,{"$f":"INDEX(ZonasPagasVigentes!$B$2:$B$1048576,MATCH(A212,ZonasPagasVigentes!$D$2:$D$1048576,0))","v":"Activa"},"inicia 27-06-2016, comienza en PMA el 17-10-2016",null,{"$f":"VLOOKUP(A212,ZonasPagasVigentes!$D:$BA,68,FALSE)","v":{"$error":"#REF!"}}]
[274,{"$f":"INDEX(ZonasPagasVigentes!$B$2:$B$1048576,MATCH(A213,ZonasPagasVigentes!$D$2:$D$1048576,0))","v":"Activa"},"inicia 27-06-2016, comienza en PMA el 28-11-2016/ Modifica su horario domingo el 24-06-2018 (pasa de 12:00-20:00 a 11:00-19:00)",null,{"$f":"VLOOKUP(A213,ZonasPagasVigentes!$D:$BA,68,FALSE)","v":{"$error":"#REF!"}}]
[275,{"$f":"INDEX(ZonasPagasVigentes!$B$2:$B$1048576,MATCH(A214,ZonasPagasVigentes!$D$2:$D$1048576,0))","v":{"$error":"#N/A"}},"inicia 27-06-2016, comienza en PMA el 28-11-2016/ Modifica su horario domingo el 24-06-2018 (pasa de 12:00-20:00 a 11:00-19:00)",null,{"$f":"VLOOKUP(A214,ZonasPagasVigentes!$D:$BA,68,FALSE)","v":{"$error":"#N/A"}}]
[276,{"$f":"INDEX(ZonasPagasVigentes!$B$2:$B$1048576,MATCH(A215,ZonasPagasVigentes!$D$2:$D$1048576,0))","v":"Eliminada"},"ex 58 reinicia el 08-07-2016",null,{"$f":"VLOOKUP(A215,ZonasPagasVigentes!$D:$BA,68,FALSE)","v":{"$error":"#REF!"}}]
[277,{"$f":"INDEX(ZonasPagasVigentes!$B$2:$B$1048576,MATCH(A216,ZonasPagasVigentes!$D$2:$D$1048576,0))","v":"Suspendida "},"ex 115 reinicia el 08-07-2016",null,{"$f":"VLOOKUP(A216,ZonasPagasVigentes!$D:$BA,68,FALSE)","v":{"$error":"#REF!"}}]
[278,{"$f":"INDEX(ZonasPagasVigentes!$B$2:$B$1048576,MATCH(A217,ZonasPagasVigentes!$D$2:$D$1048576,0))","v":"Eliminada"},"ex 173 reinicia el 08-07-2016",null,{"$f":"VLOOKUP(A217,ZonasPagasVigentes!$D:$BA,68,FALSE)","v":{"$error":"#REF!"}}]
[279,{"$f":"INDEX(ZonasPagasVigentes!$B$2:$B$1048576,MATCH(A218,ZonasPagasVigentes!$D$2:$D$1048576,0))","v":"Activa"},"ex 43 reinicia el 08-07-2016/ El día 12-07-2018 pasa de operar con 4 validadores a operar con 3",null,{"$f":"VLOOKUP(A218,ZonasPagasVigentes!$D:$BA,68,FALSE)","v":{"$error":"#REF!"}}]
[280,{"$f":"INDEX(ZonasPagasVigentes!$B$2:$B$1048576,MATCH(A219,ZonasPagasVigentes!$D$2:$D$1048576,0))","v":"Eliminada"},"ex 64 reinicia el 08-07-2016",null,{"$f":"VLOOKUP(A219,ZonasPagasVigentes!$D:$BA,68,FALSE)","v":{"$error":"#REF!"}}]
[281,{"$f":"INDEX(ZonasPagasVigentes!$B$2:$B$1048576,MATCH(A220,ZonasPagasVigentes!$D$2:$D$1048576,0))","v":"Eliminada"},"ex 97 reinicia el 08-07-2016/ El día 12-07-2018 pasa de operar con 3 validadores a operar con 2",null,{"$f":"VLOOKUP(A220,ZonasPagasVigentes!$D:$BA,68,FALSE)","v":{"$error":"#REF!"}}]
[282,{"$f":"INDEX(ZonasPagasVigentes!$B$2:$B$1048576,MATCH(A221,ZonasPagasVigentes!$D$2:$D$1048576,0))","v":"Eliminada"},"inicia 29-08-2016",null,{"$f":"VLOOKUP(A221,ZonasPagasVigentes!$D:$BA,68,FALSE)","v":{"$error":"#REF!"}}]
[283,{"$f":"INDEX(ZonasPagasVigentes!$B$2:$B$1048576,MATCH(A222,ZonasPagasVigentes!$D$2:$D$1048576,0))","v":"Activa"},"inicia 29-08-2016",null,{"$f":"VLOOKUP(A222,ZonasPagasVigentes!$D:$BA,68,FALSE)","v":{"$error":"#REF!"}}]
[284,{"$f":"INDEX(ZonasPagasVigentes!$B$2:$B$1048576,MATCH(A223,ZonasPagasVigentes!$D$2:$D$1048576,0))","v":"Activa"},"inicia 30-09-2016",null,{"$f":"VLOOKUP(A223,ZonasPagasVigentes!$D:$BA,68,FALSE)","v":{"$error":"#REF!"}}]
[285,{"$f":"INDEX(ZonasPagasVigentes!$B$2:$B$1048576,MATCH(A224,ZonasPagasVigentes!$D$2:$D$1048576,0))","v":"Activa"},"inicia 30-09-2016",null,{"$f":"VLOOKUP(A224,ZonasPagasVigentes!$D:$BA,68,FALSE)","v":{"$error":"#REF!"}}]
[286,{"$f":"INDEX(ZonasPagasVigentes!$B$2:$B$1048576,MATCH(A225,ZonasPagasVigentes!$D$2:$D$1048576,0))","v":"Activa"},"inicia 17-10-2016",null,{"$f":"VLOOKUP(A225,ZonasPagasVigentes!$D:$BA,68,FALSE)","v":{"$error":"#REF!"}}]
[287,{"$f":"INDEX(ZonasPagasVigentes!$B$2:$B$1048576,MATCH(A226,ZonasPagasVigentes!$D$2:$D$1048576,0))","v":"Activa"},"inicia 02-12-2016",null,{"$f":"VLOOKUP(A226,ZonasPagasVigentes!$D:$BA,68,FALSE)","v":{"$error":"#REF!"}}]
[288,{"$f":"INDEX(ZonasPagasVigentes!$B$2:$B$1048576,MATCH(A227,ZonasPagasVigentes!$D$2:$D$1048576,0))","v":"Suspendida "},"inicia 19-10-2016, ex ZP 69",null,{"$f":"VLOOKUP(A227,ZonasPagasVigentes!$D:$BA,68,FALSE)","v":{"$error":"#REF!"}}]
[289,{"$f":"INDEX(ZonasPagasVigentes!$B$2:$B$1048576,MATCH(A228,ZonasPagasVigentes!$D$2:$D$1048576,0))","v":"Eliminada"},"inicia 24-10-2016/ El 01-12-2017 se suspende momentáneamente su operación y se traspasa a TATA",null,{"$f":"VLOOKUP(A228,ZonasPagasVigentes!$D:$BA,68,FALSE)","v":{"$error":"#REF!"}}]
[290,{"$f":"INDEX(ZonasPagasVigentes!$B$2:$B$1048576,MATCH(A229,ZonasPagasVigentes!$D$2:$D$1048576,0))","v":"Activa"},"inicia 24-10-2016",null,{"$f":"VLOOKUP(A229,ZonasPagasVigentes!$D:$BA,68,FALSE)","v":{"$error":"#REF!"}}]
[291,{"$f":"INDEX(ZonasPagasVigentes!$B$2:$B$1048576,MATCH(A230,ZonasPagasVigentes!$D$2:$D$1048576,0))","v":"Activa"},"inicia 14-11-2016 termina 09-12-2016 - inicia 05-01-2017 - El 14-06-2018 extiende horario laboral (Pasa de 14:00 - 22:00 a 6:30 a 22:00)",null,{"$f":"VLOOKUP(A230,ZonasPagasVigentes!$D:$BA,68,FALSE)","v":{"$error":"#REF!"}}]
[292,{"$f":"INDEX(ZonasPagasVigentes!$B$2:$B$1048576,MATCH(A231,ZonasPagasVigentes!$D$2:$D$1048576,0))","v":"Suspendida "},"inicia 24-11-2016",null,{"$f":"VLOOKUP(A231,ZonasPagasVigentes!$D:$BA,68,FALSE)","v":{"$error":"#REF!"}}]
[293,{"$f":"INDEX(ZonasPagasVigentes!$B$2:$B$1048576,MATCH(A232,ZonasPagasVigentes!$D$2:$D$1048576,0))","v":"Eliminada"},"inicia 24-11-2016",null,{"$f":"VLOOKUP(A232,ZonasPagasVigentes!$D:$BA,68,FALSE)","v":{"$error":"#REF!"}}]
[294,{"$f":"INDEX(ZonasPagasVigentes!$B$2:$B$1048576,MATCH(A233,ZonasPagasVigentes!$D$2:$D$1048576,0))","v":"Suspendida "},"inicia 23-11-2016",null,{"$f":"VLOOKUP(A233,ZonasPagasVigentes!$D:$BA,68,FALSE)","v":{"$error":"#REF!"}}]
[295,{"$f":"INDEX(ZonasPagasVigentes!$B$2:$B$1048576,MATCH(A234,ZonasPagasVigentes!$D$2:$D$1048576,0))","v":"Suspendida "},"inicia 23-11-2016",null,{"$f":"VLOOKUP(A234,ZonasPagasVigentes!$D:$BA,68,FALSE)","v":{"$error":"#REF!"}}]
[296,{"$f":"INDEX(ZonasPagasVigentes!$B$2:$B$1048576,MATCH(A235,ZonasPagasVigentes!$D$2:$D$1048576,0))","v":"Activa"},"inicia 23-11-2016",null,{"$f":"VLOOKUP(A235,ZonasPagasVigentes!$D:$BA,68,FALSE)","v":{"$error":"#REF!"}}]
[297,{"$f":"INDEX(ZonasPagasVigentes!$B$2:$B$1048576,MATCH(A236,ZonasPagasVigentes!$D$2:$D$1048576,0))","v":"Activa"},"inicia 07-12-2016",null,{"$f":"VLOOKUP(A236,ZonasPagasVigentes!$D:$BA,68,FALSE)","v":{"$error":"#REF!"}}]
[298,{"$f":"INDEX(ZonasPagasVigentes!$B$2:$B$1048576,MATCH(A237,ZonasPagasVigentes!$D$2:$D$1048576,0))","v":"Activa"},"inicia 09-11-2016",null,{"$f":"VLOOKUP(A237,ZonasPagasVigentes!$D:$BA,68,FALSE)","v":{"$error":"#REF!"}}]
[299,{"$f":"INDEX(ZonasPagasVigentes!$B$2:$B$1048576,MATCH(A238,ZonasPagasVigentes!$D$2:$D$1048576,0))","v":"Eliminada"},"inicia 05-12-2016",null,{"$f":"VLOOKUP(A238,ZonasPagasVigentes!$D:$BA,68,FALSE)","v":{"$error":"#REF!"}}]
[300,{"$f":"INDEX(ZonasPagasVigentes!$B$2:$B$1048576,MATCH(A239,ZonasPagasVigentes!$D$2:$D$1048576,0))","v":"Suspendida "},"inicia 30-01-2017 / Servicio H12 no opera en la parada debido a trabajos viales EIM Franklin",null,{"$f":"VLOOKUP(A239,ZonasPagasVigentes!$D:$BA,68,FALSE)","v":{"$error":"#REF!"}}]
[301,{"$f":"INDEX(ZonasPagasVigentes!$B$2:$B$1048576,MATCH(A240,ZonasPagasVigentes!$D$2:$D$1048576,0))","v":"Eliminada"},"inicia 17-01-2017 termina 24-02-2017",null,{"$f":"VLOOKUP(A240,ZonasPagasVigentes!$D:$BA,68,FALSE)","v":{"$error":"#REF!"}},"2017-02-24"]
[302,{"$f":"INDEX(ZonasPagasVigentes!$B$2:$B$1048576,MATCH(A241,ZonasPagasVigentes!$D$2:$D$1048576,0))","v":"Eliminada"},"inicia 17-01-2017 termina 24-02-2017",null,{"$f":"VLOOKUP(A241,ZonasPagasVigentes!$D:$BA,68,FALSE)","v":{"$error":"#REF!"}},"2017-02-24"]
[303,{"$f":"INDEX(ZonasPagasVigentes!$B$2:$B$1048576,MATCH(A242,ZonasPagasVigentes!$D$2:$D$1048576,0))","v":"Activa"},"inicia 20-02-2017",null,{"$f":"VLOOKUP(A242,ZonasPagasVigentes!$D:$BA,68,FALSE)","v":{"$error":"#REF!"}}]
[304,{"$f":"INDEX(ZonasPagasVigentes!$B$2:$B$1048576,MATCH(A243,ZonasPagasVigentes!$D$2:$D$1048576,0))","v":"Activa"},"inicia 20-02-2017",null,{"$f":"VLOOKUP(A243,ZonasPagasVigentes!$D:$BA,68,FALSE)","v":{"$error":"#REF!"}}]
[305,{"$f":"INDEX(ZonasPagasVigentes!$B$2:$B$1048576,MATCH(A244,ZonasPagasVigentes!$D$2:$D$1048576,0))","v":"Activa"},"inicia 20-02-2017",null,{"$f":"VLOOKUP(A244,ZonasPagasVigentes!$D:$BA,68,FALSE)","v":{"$error":"#REF!"}}]
[306,{"$f":"INDEX(ZonasPagasVigentes!$B$2:$B$1048576,MATCH(A245,ZonasPagasVigentes!$D$2:$D$1048576,0))","v":"Activa"},"inicia 20-02-2017 / 19-03-2018 extiende su horario 1 hora (dinaliza a las 10 y se extiende a las 11)",null,{"$f":"VLOOKUP(A245,ZonasPagasVigentes!$D:$BA,68,FALSE)","v":{"$error":"#REF!"}}]
[308,{"$f":"INDEX(ZonasPagasVigentes!$B$2:$B$1048576,MATCH(A246,ZonasPagasVigentes!$D$2:$D$1048576,0))","v":"Eliminada"},"inicia 01-03-2017",null,{"$f":"VLOOKUP(A246,ZonasPagasVigentes!$D:$BA,68,FALSE)","v":{"$error":"#REF!"}}]
[309,{"$f":"INDEX(ZonasPagasVigentes!$B$2:$B$1048576,MATCH(A247,ZonasPagasVigentes!$D$2:$D$1048576,0))","v":"Eliminada"},"inicia 01-03-2017",null,{"$f":"VLOOKUP(A247,ZonasPagasVigentes!$D:$BA,68,FALSE)","v":{"$error":"#REF!"}}]
[310,{"$f":"INDEX(ZonasPagasVigentes!$B$2:$B$1048576,MATCH(A248,ZonasPagasVigentes!$D$2:$D$1048576,0))","v":"Suspendida "},"inicia 20-03-2017",null,{"$f":"VLOOKUP(A248,ZonasPagasVigentes!$D:$BA,68,FALSE)","v":{"$error":"#REF!"}}]
[311,{"$f":"INDEX(ZonasPagasVigentes!$B$2:$B$1048576,MATCH(A249,ZonasPagasVigentes!$D$2:$D$1048576,0))","v":"Suspendida "},"inicia 20-03-2017",null,{"$f":"VLOOKUP(A249,ZonasPagasVigentes!$D:$BA,68,FALSE)","v":{"$error":"#REF!"}}]
[312,{"$f":"INDEX(ZonasPagasVigentes!$B$2:$B$1048576,MATCH(A250,ZonasPagasVigentes!$D$2:$D$1048576,0))","v":"Eliminada"},"inicia 20-03-2017 termina 08-05-2017",null,{"$f":"VLOOKUP(A250,ZonasPagasVigentes!$D:$BA,68,FALSE)","v":{"$error":"#REF!"}},"2017-05-05"]
[313,{"$f":"INDEX(ZonasPagasVigentes!$B$2:$B$1048576,MATCH(A251,ZonasPagasVigentes!$D$2:$D$1048576,0))","v":"Suspendida "},"inicia 20-03-2017",null,{"$f":"VLOOKUP(A251,ZonasPagasVigentes!$D:$BA,68,FALSE)","v":{"$error":"#REF!"}}]
[314,{"$f":"INDEX(ZonasPagasVigentes!$B$2:$B$1048576,MATCH(A252,ZonasPagasVigentes!$D$2:$D$1048576,0))","v":"Suspendida "},"inicia 20-03-2017",null,{"$f":"VLOOKUP(A252,ZonasPagasVigentes!$D:$BA,68,FALSE)","v":{"$error":"#REF!"}}]
[315,{"$f":"INDEX(ZonasPagasVigentes!$B$2:$B$1048576,MATCH(A253,ZonasPagasVigentes!$D$2:$D$1048576,0))","v":"Eliminada"},"inicia 20-03-2017 termina 08-05-2017",null,{"$f":"VLOOKUP(A253,ZonasPagasVigentes!$D:$BA,68,FALSE)","v":{"$error":"#REF!"}},"2017-05-05"]
[316,{"$f":"INDEX(ZonasPagasVigentes!$B$2:$B$1048576,MATCH(A254,ZonasPagasVigentes!$D$2:$D$1048576,0))","v":"Suspendida "},"inicia 20-03-2017 / Se baja un validador y se reutiliza para ZP360",null,{"$f":"VLOOKUP(A254,ZonasPagasVigentes!$D:$BA,68,FALSE)","v":{"$error":"#REF!"}}]
[317,{"$f":"INDEX(ZonasPagasVigentes!$B$2:$B$1048576,MATCH(A255,ZonasPagasVigentes!$D$2:$D$1048576,0))","v":"Eliminada"},"inicia 24-04-2017/ El 9 de julio se incorpora servicio I25",null,{"$f":"VLOOKUP(A255,ZonasPagasVigentes!$D:$BA,68,FALSE)","v":{"$error":"#REF!"}}]
[318,{"$f":"INDEX(ZonasPagasVigentes!$B$2:$B$1048576,MATCH(A256,ZonasPagasVigentes!$D$2:$D$1048576,0))","v":"Eliminada"},"inicia 24-04-2017",null,{"$f":"VLOOKUP(A256,ZonasPagasVigentes!$D:$BA,68,FALSE)","v":{"$error":"#REF!"}}]
[319,{"$f":"INDEX(ZonasPagasVigentes!$B$2:$B$1048576,MATCH(A257,ZonasPagasVigentes!$D$2:$D$1048576,0))","v":"Activa"},"inicia 24-04-2017",null,{"$f":"VLOOKUP(A257,ZonasPagasVigentes!$D:$BA,68,FALSE)","v":{"$error":"#REF!"}}]
[320,{"$f":"INDEX(ZonasPagasVigentes!$B$2:$B$1048576,MATCH(A258,ZonasPagasVigentes!$D$2:$D$1048576,0))","v":"Eliminada"},"inicia 24-04-2017",null,{"$f":"VLOOKUP(A258,ZonasPagasVigentes!$D:$BA,68,FALSE)","v":{"$error":"#REF!"}}]
[321,{"$f":"INDEX(ZonasPagasVigentes!$B$2:$B$1048576,MATCH(A259,ZonasPagasVigentes!$D$2:$D$1048576,0))","v":"Eliminada"},"inicia 17-04-2017",null,{"$f":"VLOOKUP(A259,ZonasPagasVigentes!$D:$BA,68,FALSE)","v":{"$error":"#REF!"}}]
[322,{"$f":"INDEX(ZonasPagasVigentes!$B$2:$B$1048576,MATCH(A260,ZonasPagasVigentes!$D$2:$D$1048576,0))","v":"Activa"},"inicia 17-04-2017",null,{"$f":"VLOOKUP(A260,ZonasPagasVigentes!$D:$BA,68,FALSE)","v":{"$error":"#REF!"}}]
[323,{"$f":"INDEX(ZonasPagasVigentes!$B$2:$B$1048576,MATCH(A261,ZonasPagasVigentes!$D$2:$D$1048576,0))","v":"Activa"},"inicia 17-04-2017",null,{"$f":"VLOOKUP(A261,ZonasPagasVigentes!$D:$BA,68,FALSE)","v":{"$error":"#REF!"}}]
[324,{"$f":"INDEX(ZonasPagasVigentes!$B$2:$B$1048576,MATCH(A262,ZonasPagasVigentes!$D$2:$D$1048576,0))","v":"Eliminada"},"inicia 17-04-2017",null,{"$f":"VLOOKUP(A262,ZonasPagasVigentes!$D:$BA,68,FALSE)","v":{"$error":"#REF!"}}]
[325,{"$f":"INDEX(ZonasPagasVigentes!$B$2:$B$1048576,MATCH(A263,ZonasPagasVigentes!$D$2:$D$1048576,0))","v":"Activa"},"inicia 17-04-2017 / El 01-03-2018 atrasa su fin en una hora (desde las 21:00 a las 22:00) / El 20-03-2018 comienza a operar desde las 6:00 hasta las 21:00",null,{"$f":"VLOOKUP(A263,ZonasPagasVigentes!$D:$BA,68,FALSE)","v":{"$error":"#REF!"}}]
[326,{"$f":"INDEX(ZonasPagasVigentes!$B$2:$B$1048576,MATCH(A264,ZonasPagasVigentes!$D$2:$D$1048576,0))","v":"Eliminada"},"inicia 26-04-2017 / Finalizó 05-07-2017 (cambió codigo a 341)",null,{"$f":"VLOOKUP(A264,ZonasPagasVigentes!$D:$BA,68,FALSE)","v":{"$error":"#REF!"}},"2017-07-05"]
[327,{"$f":"INDEX(ZonasPagasVigentes!$B$2:$B$1048576,MATCH(A265,ZonasPagasVigentes!$D$2:$D$1048576,0))","v":"Eliminada"},"inicia 26-04-2017",null,{"$f":"VLOOKUP(A265,ZonasPagasVigentes!$D:$BA,68,FALSE)","v":{"$error":"#REF!"}}]
[328,{"$f":"INDEX(ZonasPagasVigentes!$B$2:$B$1048576,MATCH(A266,ZonasPagasVigentes!$D$2:$D$1048576,0))","v":"Eliminada"},"inicia 02-05-2017",null,{"$f":"VLOOKUP(A266,ZonasPagasVigentes!$D:$BA,68,FALSE)","v":{"$error":"#REF!"}}]
[329,{"$f":"INDEX(ZonasPagasVigentes!$B$2:$B$1048576,MATCH(A267,ZonasPagasVigentes!$D$2:$D$1048576,0))","v":"Activa"},"inicia 02-05-2017",null,{"$f":"VLOOKUP(A267,ZonasPagasVigentes!$D:$BA,68,FALSE)","v":{"$error":"#REF!"}}]
[330,{"$f":"INDEX(ZonasPagasVigentes!$B$2:$B$1048576,MATCH(A268,ZonasPagasVigentes!$D$2:$D$1048576,0))","v":"Eliminada"},"inicia 02-05-2017",null,{"$f":"VLOOKUP(A268,ZonasPagasVigentes!$D:$BA,68,FALSE)","v":{"$error":"#REF!"}}]
[331,{"$f":"INDEX(ZonasPagasVigentes!$B$2:$B$1048576,MATCH(A269,ZonasPagasVigentes!$D$2:$D$1048576,0))","v":"Suspendida "},"inicia 08-05-2017/ El 11-04-2018 Operador corrige horario de operació informado (Anteriormente era de 6:00 a 12:00, ahora de 6:00 a 10:00)",null,{"$f":"VLOOKUP(A269,ZonasPagasVigentes!$D:$BA,68,FALSE)","v":{"$error":"#REF!"}}]
[332,{"$f":"INDEX(ZonasPagasVigentes!$B$2:$B$1048576,MATCH(A270,ZonasPagasVigentes!$D$2:$D$1048576,0))","v":"Activa"},"inicia 08-05-2017",null,{"$f":"VLOOKUP(A270,ZonasPagasVigentes!$D:$BA,68,FALSE)","v":{"$error":"#REF!"}}]
[333,{"$f":"INDEX(ZonasPagasVigentes!$B$2:$B$1048576,MATCH(A271,ZonasPagasVigentes!$D$2:$D$1048576,0))","v":"Eliminada"},"inicia 26-05-2017",null,{"$f":"VLOOKUP(A271,ZonasPagasVigentes!$D:$BA,68,FALSE)","v":{"$error":"#REF!"}}]
[334,{"$f":"INDEX(ZonasPagasVigentes!$B$2:$B$1048576,MATCH(A272,ZonasPagasVigentes!$D$2:$D$1048576,0))","v":"Activa"},"inicia 29-05-2017",null,{"$f":"VLOOKUP(A272,ZonasPagasVigentes!$D:$BA,68,FALSE)","v":{"$error":"#REF!"}}]
[307,{"$f":"INDEX(ZonasPagasVigentes!$B$2:$B$1048576,MATCH(A273,ZonasPagasVigentes!$D$2:$D$1048576,0))","v":"Activa"},"inicia 21-04-2017",null,{"$f":"VLOOKUP(A273,ZonasPagasVigentes!$D:$BA,68,FALSE)","v":{"$error":"#REF!"}}]
[335,{"$f":"INDEX(ZonasPagasVigentes!$B$2:$B$1048576,MATCH(A274,ZonasPagasVigentes!$D$2:$D$1048576,0))","v":"Activa"},"inicia 07-06-2017",null,{"$f":"VLOOKUP(A274,ZonasPagasVigentes!$D:$BA,68,FALSE)","v":{"$error":"#REF!"}}]
[336,{"$f":"INDEX(ZonasPagasVigentes!$B$2:$B$1048576,MATCH(A275,ZonasPagasVigentes!$D$2:$D$1048576,0))","v":"Activa"},"inicia 19-06-2017",null,{"$f":"VLOOKUP(A275,ZonasPagasVigentes!$D:$BA,68,FALSE)","v":{"$error":"#REF!"}}]
[337,{"$f":"INDEX(ZonasPagasVigentes!$B$2:$B$1048576,MATCH(A276,ZonasPagasVigentes!$D$2:$D$1048576,0))","v":"Eliminada"},"inicia 19-06-2017 / Comienza a operar como ZP Mixta (sólo entre U3 y U5), el 23-08-2017/ Suspendida el 21-09-2017",null,{"$f":"VLOOKUP(A276,ZonasPagasVigentes!$D:$BA,68,FALSE)","v":{"$error":"#REF!"}},"2017-09-21"]
[338,{"$f":"INDEX(ZonasPagasVigentes!$B$2:$B$1048576,MATCH(A277,ZonasPagasVigentes!$D$2:$D$1048576,0))","v":"Eliminada"},"inicia 19-06-2017 / Comienza a operar como ZP Mixta (sólo entre U3 y U5), el 23-08-2017/ Suspendida el 21-09-2017",null,{"$f":"VLOOKUP(A277,ZonasPagasVigentes!$D:$BA,68,FALSE)","v":{"$error":"#REF!"}},"2017-09-21"]
[339,{"$f":"INDEX(ZonasPagasVigentes!$B$2:$B$1048576,MATCH(A278,ZonasPagasVigentes!$D$2:$D$1048576,0))","v":"Activa"},"inicia 28-06-2017",null,{"$f":"VLOOKUP(A278,ZonasPagasVigentes!$D:$BA,68,FALSE)","v":{"$error":"#REF!"}}]
[340,{"$f":"INDEX(ZonasPagasVigentes!$B$2:$B$1048576,MATCH(A279,ZonasPagasVigentes!$D$2:$D$1048576,0))","v":"Eliminada"},"inicia 05-07-2017 / Finaliza el 29-08-2017",null,{"$f":"VLOOKUP(A279,ZonasPagasVigentes!$D:$BA,68,FALSE)","v":{"$error":"#REF!"}},"2017-08-31"]
[341,{"$f":"INDEX(ZonasPagasVigentes!$B$2:$B$1048576,MATCH(A280,ZonasPagasVigentes!$D$2:$D$1048576,0))","v":"Eliminada"},"inicia 05-07-2017",null,{"$f":"VLOOKUP(A280,ZonasPagasVigentes!$D:$BA,68,FALSE)","v":{"$error":"#REF!"}}]
[342,{"$f":"INDEX(ZonasPagasVigentes!$B$2:$B$1048576,MATCH(A281,ZonasPagasVigentes!$D$2:$D$1048576,0))","v":"Eliminada"},"inicia 31-07-2017/ Finaliza debido a problemas de seguridad asociado a falta de luminaria",null,{"$f":"VLOOKUP(A281,ZonasPagasVigentes!$D:$BA,68,FALSE)","v":{"$error":"#REF!"}},"2018-03-08"]
[343,{"$f":"INDEX(ZonasPagasVigentes!$B$2:$B$1048576,MATCH(A282,ZonasPagasVigentes!$D$2:$D$1048576,0))","v":"Activa"},"inicia 31-07-2017",null,{"$f":"VLOOKUP(A282,ZonasPagasVigentes!$D:$BA,68,FALSE)","v":{"$error":"#REF!"}}]
[344,{"$f":"INDEX(ZonasPagasVigentes!$B$2:$B$1048576,MATCH(A283,ZonasPagasVigentes!$D$2:$D$1048576,0))","v":"Suspendida "},"inicia 31-07-2017 / Deja de ser ZPMixta hasta el 10-03-2018",null,{"$f":"VLOOKUP(A283,ZonasPagasVigentes!$D:$BA,68,FALSE)","v":{"$error":"#REF!"}}]
[345,{"$f":"INDEX(ZonasPagasVigentes!$B$2:$B$1048576,MATCH(A284,ZonasPagasVigentes!$D$2:$D$1048576,0))","v":"Eliminada"},"inicia 31-07-2017",null,{"$f":"VLOOKUP(A284,ZonasPagasVigentes!$D:$BA,68,FALSE)","v":{"$error":"#REF!"}}]
[346,{"$f":"INDEX(ZonasPagasVigentes!$B$2:$B$1048576,MATCH(A285,ZonasPagasVigentes!$D$2:$D$1048576,0))","v":"Eliminada"},"inicia 31-07-2017",null,{"$f":"VLOOKUP(A285,ZonasPagasVigentes!$D:$BA,68,FALSE)","v":{"$error":"#REF!"}}]
[348,{"$f":"INDEX(ZonasPagasVigentes!$B$2:$B$1048576,MATCH(A286,ZonasPagasVigentes!$D$2:$D$1048576,0))","v":"Activa"},"inicia 10-08-2017/ El 15 de marzo de 2018 pasa a ser mixta, se agrega 421",null,{"$f":"VLOOKUP(A286,ZonasPagasVigentes!$D:$BA,68,FALSE)","v":{"$error":"#REF!"}}]
[349,{"$f":"INDEX(ZonasPagasVigentes!$B$2:$B$1048576,MATCH(A287,ZonasPagasVigentes!$D$2:$D$1048576,0))","v":"Activa"},"inicia 22-08-2017",null,{"$f":"VLOOKUP(A287,ZonasPagasVigentes!$D:$BA,68,FALSE)","v":{"$error":"#REF!"}}]
[350,{"$f":"INDEX(ZonasPagasVigentes!$B$2:$B$1048576,MATCH(A288,ZonasPagasVigentes!$D$2:$D$1048576,0))","v":"Activa"},"inicia 30-08-2017",null,{"$f":"VLOOKUP(A288,ZonasPagasVigentes!$D:$BA,68,FALSE)","v":{"$error":"#REF!"}}]
[351,{"$f":"INDEX(ZonasPagasVigentes!$B$2:$B$1048576,MATCH(A289,ZonasPagasVigentes!$D$2:$D$1048576,0))","v":"Eliminada"},"inicia 01-09-2017/ suspendida por obras viales entre el 12-01-18 y el 07-03-18",null,{"$f":"VLOOKUP(A289,ZonasPagasVigentes!$D:$BA,68,FALSE)","v":{"$error":"#REF!"}},"2018-01-12"]
[352,{"$f":"INDEX(ZonasPagasVigentes!$B$2:$B$1048576,MATCH(A290,ZonasPagasVigentes!$D$2:$D$1048576,0))","v":"Activa"},"inicia 01-09-2017 / Se agrega 1 validador el 22 de Mayo del 208",null,{"$f":"VLOOKUP(A290,ZonasPagasVigentes!$D:$BA,68,FALSE)","v":{"$error":"#REF!"}}]
[353,{"$f":"INDEX(ZonasPagasVigentes!$B$2:$B$1048576,MATCH(A291,ZonasPagasVigentes!$D$2:$D$1048576,0))","v":"Activa"},"Inicia 05-09-2017/ baja operación 22 -11-17 y vuelve a operar 5-03-18 por trabajos",null,{"$f":"VLOOKUP(A291,ZonasPagasVigentes!$D:$BA,68,FALSE)","v":{"$error":"#REF!"}}]
[354,{"$f":"INDEX(ZonasPagasVigentes!$B$2:$B$1048576,MATCH(A292,ZonasPagasVigentes!$D$2:$D$1048576,0))","v":"Activa"},"Inicia 03-10-2017",null,{"$f":"VLOOKUP(A292,ZonasPagasVigentes!$D:$BA,68,FALSE)","v":{"$error":"#REF!"}}]
[355,{"$f":"INDEX(ZonasPagasVigentes!$B$2:$B$1048576,MATCH(A293,ZonasPagasVigentes!$D$2:$D$1048576,0))","v":"Activa"},"Fusión entre ex 117 y 195",null,{"$f":"VLOOKUP(A293,ZonasPagasVigentes!$D:$BA,68,FALSE)","v":{"$error":"#REF!"}}]
[356,{"$f":"INDEX(ZonasPagasVigentes!$B$2:$B$1048576,MATCH(A294,ZonasPagasVigentes!$D$2:$D$1048576,0))","v":"Suspendida "},"Inicia 10-10-2017",null,{"$f":"VLOOKUP(A294,ZonasPagasVigentes!$D:$BA,68,FALSE)","v":{"$error":"#REF!"}}]
[357,{"$f":"INDEX(ZonasPagasVigentes!$B$2:$B$1048576,MATCH(A295,ZonasPagasVigentes!$D$2:$D$1048576,0))","v":"Activa"},"Inicia 18-10-2017",null,{"$f":"VLOOKUP(A295,ZonasPagasVigentes!$D:$BA,68,FALSE)","v":{"$error":"#REF!"}}]
[358,{"$f":"INDEX(ZonasPagasVigentes!$B$2:$B$1048576,MATCH(A296,ZonasPagasVigentes!$D$2:$D$1048576,0))","v":"Eliminada"},"Inicia 07-11-2017",null,{"$f":"VLOOKUP(A296,ZonasPagasVigentes!$D:$BA,68,FALSE)","v":{"$error":"#REF!"}}]
[359,{"$f":"INDEX(ZonasPagasVigentes!$B$2:$B$1048576,MATCH(A297,ZonasPagasVigentes!$D$2:$D$1048576,0))","v":"Activa"},"Inicia 15-11-2017",null,{"$f":"VLOOKUP(A297,ZonasPagasVigentes!$D:$BA,68,FALSE)","v":{"$error":"#REF!"}}]
[360,{"$f":"INDEX(ZonasPagasVigentes!$B$2:$B$1048576,MATCH(A298,ZonasPagasVigentes!$D$2:$D$1048576,0))","v":"Suspendida "},"Inicia 20-11-2017",null,{"$f":"VLOOKUP(A298,ZonasPagasVigentes!$D:$BA,68,FALSE)","v":{"$error":"#REF!"}}]
[361,{"$f":"INDEX(ZonasPagasVigentes!$B$2:$B$1048576,MATCH(A299,ZonasPagasVigentes!$D$2:$D$1048576,0))","v":"Eliminada"},"Inicia operación 25-01-2018",null,{"$f":"VLOOKUP(A299,ZonasPagasVigentes!$D:$BA,68,FALSE)","v":{"$error":"#REF!"}}]
[362,{"$f":"INDEX(ZonasPagasVigentes!$B$2:$B$1048576,MATCH(A300,ZonasPagasVigentes!$D$2:$D$1048576,0))","v":"Eliminada"},"Inicia operación 25-01-2018",null,{"$f":"VLOOKUP(A300,ZonasPagasVigentes!$D:$BA,68,FALSE)","v":{"$error":"#REF!"}}]
[363,{"$f":"INDEX(ZonasPagasVigentes!$B$2:$B$1048576,MATCH(A301,ZonasPagasVigentes!$D$2:$D$1048576,0))","v":"Eliminada"},"Inicia 01-12-2017",null,{"$f":"VLOOKUP(A301,ZonasPagasVigentes!$D:$BA,68,FALSE)","v":{"$error":"#REF!"}}]
[364,{"$f":"INDEX(ZonasPagasVigentes!$B$2:$B$1048576,MATCH(A302,ZonasPagasVigentes!$D$2:$D$1048576,0))","v":"Eliminada"},"Inicia 01-12-2017",null,{"$f":"VLOOKUP(A302,ZonasPagasVigentes!$D:$BA,68,FALSE)","v":{"$error":"#REF!"}}]
[365,{"$f":"INDEX(ZonasPagasVigentes!$B$2:$B$1048576,MATCH(A303,ZonasPagasVigentes!$D$2:$D$1048576,0))","v":"Eliminada"},"Inicia 07-12-2017",null,{"$f":"VLOOKUP(A303,ZonasPagasVigentes!$D:$BA,68,FALSE)","v":{"$error":"#REF!"}}]
[366,{"$f":"INDEX(ZonasPagasVigentes!$B$2:$B$1048576,MATCH(A304,ZonasPagasVigentes!$D$2:$D$1048576,0))","v":"Eliminada"},"Inicia 07-12-2017/ El 01 de julio de 2018 comienza a operar día domingo",null,{"$f":"VLOOKUP(A304,ZonasPagasVigentes!$D:$BA,68,FALSE)","v":{"$error":"#REF!"}},null,null,null,"2018-07-01"]
[367,{"$f":"INDEX(ZonasPagasVigentes!$B$2:$B$1048576,MATCH(A305,ZonasPagasVigentes!$D$2:$D$1048576,0))","v":"Eliminada"},"Inicia 07-12-2017 / sufre modificaciones en sus servicios entre el 12-01-2018 y el 06-03-2018. Recibe servicios de ZP 351 suspendida./ Desde 01-07-2018 opera Domingo entre 11:00 y 19:00",null,{"$f":"VLOOKUP(A305,ZonasPagasVigentes!$D:$BA,68,FALSE)","v":{"$error":"#REF!"}}]
[368,{"$f":"INDEX(ZonasPagasVigentes!$B$2:$B$1048576,MATCH(A306,ZonasPagasVigentes!$D$2:$D$1048576,0))","v":"Eliminada"},"Inicia 07-12-2017/ El 01 de julio de 2018 comienza a operar día domingo",null,{"$f":"VLOOKUP(A306,ZonasPagasVigentes!$D:$BA,68,FALSE)","v":{"$error":"#REF!"}},null,null,null,"2018-07-01"]
[369,{"$f":"INDEX(ZonasPagasVigentes!$B$2:$B$1048576,MATCH(A307,ZonasPagasVigentes!$D$2:$D$1048576,0))","v":"Eliminada"},"operador decide supender su apertura por temas logisticos",null,{"$f":"VLOOKUP(A307,ZonasPagasVigentes!$D:$BA,68,FALSE)","v":{"$error":"#REF!"}},"nunca operó"]
[370,{"$f":"INDEX(ZonasPagasVigentes!$B$2:$B$1048576,MATCH(A308,ZonasPagasVigentes!$D$2:$D$1048576,0))","v":"Eliminada"},"operador decide supender su apertura por temas logisticos",null,{"$f":"VLOOKUP(A308,ZonasPagasVigentes!$D:$BA,68,FALSE)","v":{"$error":"#REF!"}},"nunca operó"]
[371,{"$f":"INDEX(ZonasPagasVigentes!$B$2:$B$1048576,MATCH(A309,ZonasPagasVigentes!$D$2:$D$1048576,0))","v":"Activa"},"Inicia 11-12-2017",null,{"$f":"VLOOKUP(A309,ZonasPagasVigentes!$D:$BA,68,FALSE)","v":{"$error":"#REF!"}}]
[372,{"$f":"INDEX(ZonasPagasVigentes!$B$2:$B$1048576,MATCH(A310,ZonasPagasVigentes!$D$2:$D$1048576,0))","v":"Activa"},"Inicia 11-12-2017",null,{"$f":"VLOOKUP(A310,ZonasPagasVigentes!$D:$BA,68,FALSE)","v":{"$error":"#REF!"}}]
[373,{"$f":"INDEX(ZonasPagasVigentes!$B$2:$B$1048576,MATCH(A311,ZonasPagasVigentes!$D$2:$D$1048576,0))","v":"Activa"},"Inicia 13-12-2017",null,{"$f":"VLOOKUP(A311,ZonasPagasVigentes!$D:$BA,68,FALSE)","v":{"$error":"#REF!"}}]
[374,{"$f":"INDEX(ZonasPagasVigentes!$B$2:$B$1048576,MATCH(A312,ZonasPagasVigentes!$D$2:$D$1048576,0))","v":"Activa"},"Inicia 13-12-2017",null,{"$f":"VLOOKUP(A312,ZonasPagasVigentes!$D:$BA,68,FALSE)","v":{"$error":"#REF!"}}]
[375,{"$f":"INDEX(ZonasPagasVigentes!$B$2:$B$1048576,MATCH(A313,ZonasPagasVigentes!$D$2:$D$1048576,0))","v":"Activa"},"Inicia 13-12-2017",null,{"$f":"VLOOKUP(A313,ZonasPagasVigentes!$D:$BA,68,FALSE)","v":{"$error":"#REF!"}}]
[376,{"$f":"INDEX(ZonasPagasVigentes!$B$2:$B$1048576,MATCH(A314,ZonasPagasVigentes!$D$2:$D$1048576,0))","v":"Suspendida "},"Inicia 13-12-2017",null,{"$f":"VLOOKUP(A314,ZonasPagasVigentes!$D:$BA,68,FALSE)","v":{"$error":"#REF!"}}]
[377,{"$f":"INDEX(ZonasPagasVigentes!$B$2:$B$1048576,MATCH(A315,ZonasPagasVigentes!$D$2:$D$1048576,0))","v":"Activa"},"Inicia 13-12-2017",null,{"$f":"VLOOKUP(A315,ZonasPagasVigentes!$D:$BA,68,FALSE)","v":{"$error":"#REF!"}}]
[378,{"$f":"INDEX(ZonasPagasVigentes!$B$2:$B$1048576,MATCH(A316,ZonasPagasVigentes!$D$2:$D$1048576,0))","v":"Activa"},"Inicia 13-12-2017",null,{"$f":"VLOOKUP(A316,ZonasPagasVigentes!$D:$BA,68,FALSE)","v":{"$error":"#REF!"}}]
[379,{"$f":"INDEX(ZonasPagasVigentes!$B$2:$B$1048576,MATCH(A317,ZonasPagasVigentes!$D$2:$D$1048576,0))","v":"Suspendida "},"Inicia 19-12-2017",null,{"$f":"VLOOKUP(A317,ZonasPagasVigentes!$D:$BA,68,FALSE)","v":{"$error":"#REF!"}}]
[380,{"$f":"INDEX(ZonasPagasVigentes!$B$2:$B$1048576,MATCH(A318,ZonasPagasVigentes!$D$2:$D$1048576,0))","v":"Eliminada"},"Inicia 19-12-2017",null,{"$f":"VLOOKUP(A318,ZonasPagasVigentes!$D:$BA,68,FALSE)","v":{"$error":"#REF!"}}]
[381,{"$f":"INDEX(ZonasPagasVigentes!$B$2:$B$1048576,MATCH(A319,ZonasPagasVigentes!$D$2:$D$1048576,0))","v":"Activa"},"Inicia 22-12-2017",null,{"$f":"VLOOKUP(A319,ZonasPagasVigentes!$D:$BA,68,FALSE)","v":{"$error":"#REF!"}}]
[382,{"$f":"INDEX(ZonasPagasVigentes!$B$2:$B$1048576,MATCH(A320,ZonasPagasVigentes!$D$2:$D$1048576,0))","v":"Activa"},"Inicia 22-12-2017",null,{"$f":"VLOOKUP(A320,ZonasPagasVigentes!$D:$BA,68,FALSE)","v":{"$error":"#REF!"}}]
[{"$f":"+ZonasPagasVigentes!D322","v":383},{"$f":"INDEX(ZonasPagasVigentes!$B$2:$B$1048576,MATCH(A321,ZonasPagasVigentes!$D$2:$D$1048576,0))","v":"Eliminada"},"Inicia 05-01-2018",null,{"$f":"VLOOKUP(A321,ZonasPagasVigentes!$D:$BA,68,FALSE)","v":{"$error":"#REF!"}}]
[{"$f":"+ZonasPagasVigentes!D323","v":384},{"$f":"INDEX(ZonasPagasVigentes!$B$2:$B$1048576,MATCH(A322,ZonasPagasVigentes!$D$2:$D$1048576,0))","v":"Eliminada"},"Inicia 05-01-2018",null,{"$f":"VLOOKUP(A322,ZonasPagasVigentes!$D:$BA,68,FALSE)","v":{"$error":"#REF!"}}]
[{"$f":"+ZonasPagasVigentes!D324","v":385},{"$f":"INDEX(ZonasPagasVigentes!$B$2:$B$1048576,MATCH(A323,ZonasPagasVigentes!$D$2:$D$1048576,0))","v":"Activa"},"Inicia 05-01-2018",null,{"$f":"VLOOKUP(A323,ZonasPagasVigentes!$D:$BA,68,FALSE)","v":{"$error":"#REF!"}}]
[{"$f":"+ZonasPagasVigentes!D325","v":386},{"$f":"INDEX(ZonasPagasVigentes!$B$2:$B$1048576,MATCH(A324,ZonasPagasVigentes!$D$2:$D$1048576,0))","v":"Activa"},"Inicia 08-01-2018",null,{"$f":"VLOOKUP(A324,ZonasPagasVigentes!$D:$BA,68,FALSE)","v":{"$error":"#REF!"}}]
[{"$f":"+ZonasPagasVigentes!D326","v":387},{"$f":"INDEX(ZonasPagasVigentes!$B$2:$B$1048576,MATCH(A325,ZonasPagasVigentes!$D$2:$D$1048576,0))","v":"Eliminada"},"Inicia 05-01-2018",null,{"$f":"VLOOKUP(A325,ZonasPagasVigentes!$D:$BA,68,FALSE)","v":{"$error":"#REF!"}}]
[{"$f":"+ZonasPagasVigentes!D327","v":388},{"$f":"INDEX(ZonasPagasVigentes!$B$2:$B$1048576,MATCH(A326,ZonasPagasVigentes!$D$2:$D$1048576,0))","v":"Activa"},"Inicia 05-01-2018",null,{"$f":"VLOOKUP(A326,ZonasPagasVigentes!$D:$BA,68,FALSE)","v":{"$error":"#REF!"}}]
[{"$f":"+ZonasPagasVigentes!D328","v":389},{"$f":"INDEX(ZonasPagasVigentes!$B$2:$B$1048576,MATCH(A327,ZonasPagasVigentes!$D$2:$D$1048576,0))","v":"Activa"},"Inicia 08-01-2019",null,{"$f":"VLOOKUP(A327,ZonasPagasVigentes!$D:$BA,68,FALSE)","v":{"$error":"#REF!"}}]
[{"$f":"+ZonasPagasVigentes!D329","v":390},{"$f":"INDEX(ZonasPagasVigentes!$B$2:$B$1048576,MATCH(A328,ZonasPagasVigentes!$D$2:$D$1048576,0))","v":"Activa"},"Inicia 05-01-2018",null,{"$f":"VLOOKUP(A328,ZonasPagasVigentes!$D:$BA,68,FALSE)","v":{"$error":"#REF!"}}]
[391,{"$f":"INDEX(ZonasPagasVigentes!$B$2:$B$1048576,MATCH(A329,ZonasPagasVigentes!$D$2:$D$1048576,0))","v":"Eliminada"},null,null,{"$f":"VLOOKUP(A329,ZonasPagasVigentes!$D:$BA,68,FALSE)","v":{"$error":"#REF!"}}]
[392,{"$f":"INDEX(ZonasPagasVigentes!$B$2:$B$1048576,MATCH(A330,ZonasPagasVigentes!$D$2:$D$1048576,0))","v":"Activa"},null,null,{"$f":"VLOOKUP(A330,ZonasPagasVigentes!$D:$BA,68,FALSE)","v":{"$error":"#REF!"}}]
[393,{"$f":"INDEX(ZonasPagasVigentes!$B$2:$B$1048576,MATCH(A331,ZonasPagasVigentes!$D$2:$D$1048576,0))","v":"Activa"},null,null,{"$f":"VLOOKUP(A331,ZonasPagasVigentes!$D:$BA,68,FALSE)","v":{"$error":"#REF!"}}]
[394,{"$f":"INDEX(ZonasPagasVigentes!$B$2:$B$1048576,MATCH(A332,ZonasPagasVigentes!$D$2:$D$1048576,0))","v":"Activa"},null,null,{"$f":"VLOOKUP(A332,ZonasPagasVigentes!$D:$BA,68,FALSE)","v":{"$error":"#REF!"}}]
[395,{"$f":"INDEX(ZonasPagasVigentes!$B$2:$B$1048576,MATCH(A333,ZonasPagasVigentes!$D$2:$D$1048576,0))","v":"Activa"},null,null,{"$f":"VLOOKUP(A333,ZonasPagasVigentes!$D:$BA,68,FALSE)","v":{"$error":"#REF!"}}]
[396,{"$f":"INDEX(ZonasPagasVigentes!$B$2:$B$1048576,MATCH(A334,ZonasPagasVigentes!$D$2:$D$1048576,0))","v":"Activa"},null,null,{"$f":"VLOOKUP(A334,ZonasPagasVigentes!$D:$BA,68,FALSE)","v":{"$error":"#REF!"}}]
[397,{"$f":"INDEX(ZonasPagasVigentes!$B$2:$B$1048576,MATCH(A335,ZonasPagasVigentes!$D$2:$D$1048576,0))","v":"Eliminada"},null,null,{"$f":"VLOOKUP(A335,ZonasPagasVigentes!$D:$BA,68,FALSE)","v":{"$error":"#REF!"}}]
[398,{"$f":"INDEX(ZonasPagasVigentes!$B$2:$B$1048576,MATCH(A336,ZonasPagasVigentes!$D$2:$D$1048576,0))","v":"Eliminada"},null,null,{"$f":"VLOOKUP(A336,ZonasPagasVigentes!$D:$BA,68,FALSE)","v":{"$error":"#REF!"}}]
[399,{"$f":"INDEX(ZonasPagasVigentes!$B$2:$B$1048576,MATCH(A337,ZonasPagasVigentes!$D$2:$D$1048576,0))","v":"Activa"},null,null,{"$f":"VLOOKUP(A337,ZonasPagasVigentes!$D:$BA,68,FALSE)","v":{"$error":"#REF!"}}]
[400,{"$f":"INDEX(ZonasPagasVigentes!$B$2:$B$1048576,MATCH(A338,ZonasPagasVigentes!$D$2:$D$1048576,0))","v":"Eliminada"},"El lunes 18 de junio pasa a ser ZP Mixta (previo era exclusiva de U7), se incorpora 209R y 209eR",null,{"$f":"VLOOKUP(A338,ZonasPagasVigentes!$D:$BA,68,FALSE)","v":{"$error":"#REF!"}}]
[401,{"$f":"INDEX(ZonasPagasVigentes!$B$2:$B$1048576,MATCH(A339,ZonasPagasVigentes!$D$2:$D$1048576,0))","v":"Activa"},null,null,{"$f":"VLOOKUP(A339,ZonasPagasVigentes!$D:$BA,68,FALSE)","v":{"$error":"#REF!"}}]
[402,{"$f":"INDEX(ZonasPagasVigentes!$B$2:$B$1048576,MATCH(A340,ZonasPagasVigentes!$D$2:$D$1048576,0))","v":"Activa"},null,null,{"$f":"VLOOKUP(A340,ZonasPagasVigentes!$D:$BA,68,FALSE)","v":{"$error":"#REF!"}}]
[403,{"$f":"INDEX(ZonasPagasVigentes!$B$2:$B$1048576,MATCH(A341,ZonasPagasVigentes!$D$2:$D$1048576,0))","v":"Activa"},null,null,{"$f":"VLOOKUP(A341,ZonasPagasVigentes!$D:$BA,68,FALSE)","v":{"$error":"#REF!"}}]
[404,{"$f":"INDEX(ZonasPagasVigentes!$B$2:$B$1048576,MATCH(A342,ZonasPagasVigentes!$D$2:$D$1048576,0))","v":"Suspendida "},null,null,{"$f":"VLOOKUP(A342,ZonasPagasVigentes!$D:$BA,68,FALSE)","v":{"$error":"#REF!"}}]
[405,{"$f":"INDEX(ZonasPagasVigentes!$B$2:$B$1048576,MATCH(A343,ZonasPagasVigentes!$D$2:$D$1048576,0))","v":"Activa"},null,null,{"$f":"VLOOKUP(A343,ZonasPagasVigentes!$D:$BA,68,FALSE)","v":{"$error":"#REF!"}}]
[406,{"$f":"INDEX(ZonasPagasVigentes!$B$2:$B$1048576,MATCH(A344,ZonasPagasVigentes!$D$2:$D$1048576,0))","v":"Activa"},null,null,{"$f":"VLOOKUP(A344,ZonasPagasVigentes!$D:$BA,68,FALSE)","v":{"$error":"#REF!"}}]
[407,{"$f":"INDEX(ZonasPagasVigentes!$B$2:$B$1048576,MATCH(A345,ZonasPagasVigentes!$D$2:$D$1048576,0))","v":"Activa"},null,null,{"$f":"VLOOKUP(A345,ZonasPagasVigentes!$D:$BA,68,FALSE)","v":{"$error":"#REF!"}}]
[408,{"$f":"INDEX(ZonasPagasVigentes!$B$2:$B$1048576,MATCH(A346,ZonasPagasVigentes!$D$2:$D$1048576,0))","v":"Suspendida "},null,null,{"$f":"VLOOKUP(A346,ZonasPagasVigentes!$D:$BA,68,FALSE)","v":{"$error":"#REF!"}}]
[409,{"$f":"INDEX(ZonasPagasVigentes!$B$2:$B$1048576,MATCH(A347,ZonasPagasVigentes!$D$2:$D$1048576,0))","v":"Suspendida "},null,null,{"$f":"VLOOKUP(A347,ZonasPagasVigentes!$D:$BA,68,FALSE)","v":{"$error":"#REF!"}}]
[410,{"$f":"INDEX(ZonasPagasVigentes!$B$2:$B$1048576,MATCH(A348,ZonasPagasVigentes!$D$2:$D$1048576,0))","v":"Activa"},"Apartir del 21-12-2018, por accidente de bus ",null,{"$f":"VLOOKUP(A348,ZonasPagasVigentes!$D:$BA,68,FALSE)","v":{"$error":"#REF!"}}]
[411,{"$f":"INDEX(ZonasPagasVigentes!$B$2:$B$1048576,MATCH(A349,ZonasPagasVigentes!$D$2:$D$1048576,0))","v":"Activa"},null,null,{"$f":"VLOOKUP(A349,ZonasPagasVigentes!$D:$BA,68,FALSE)","v":{"$error":"#REF!"}}]
[412,{"$f":"INDEX(ZonasPagasVigentes!$B$2:$B$1048576,MATCH(A350,ZonasPagasVigentes!$D$2:$D$1048576,0))","v":"Activa"},null,null,{"$f":"VLOOKUP(A350,ZonasPagasVigentes!$D:$BA,68,FALSE)","v":{"$error":"#REF!"}}]
[413,{"$f":"INDEX(ZonasPagasVigentes!$B$2:$B$1048576,MATCH(A351,ZonasPagasVigentes!$D$2:$D$1048576,0))","v":"Eliminada"},null,null,{"$f":"VLOOKUP(A351,ZonasPagasVigentes!$D:$BA,68,FALSE)","v":{"$error":"#REF!"}}]
[414,{"$f":"INDEX(ZonasPagasVigentes!$B$2:$B$1048576,MATCH(A352,ZonasPagasVigentes!$D$2:$D$1048576,0))","v":"Suspendida "},null,null,{"$f":"VLOOKUP(A352,ZonasPagasVigentes!$D:$BA,68,FALSE)","v":{"$error":"#REF!"}}]
[415,{"$f":"INDEX(ZonasPagasVigentes!$B$2:$B$1048576,MATCH(A353,ZonasPagasVigentes!$D$2:$D$1048576,0))","v":"Activa"},null,null,{"$f":"VLOOKUP(A353,ZonasPagasVigentes!$D:$BA,68,FALSE)","v":{"$error":"#REF!"}}]
[416,{"$f":"INDEX(ZonasPagasVigentes!$B$2:$B$1048576,MATCH(A354,ZonasPagasVigentes!$D$2:$D$1048576,0))","v":"Activa"},null,null,{"$f":"VLOOKUP(A354,ZonasPagasVigentes!$D:$BA,68,FALSE)","v":{"$error":"#REF!"}}]
[417,{"$f":"INDEX(ZonasPagasVigentes!$B$2:$B$1048576,MATCH(A355,ZonasPagasVigentes!$D$2:$D$1048576,0))","v":"Eliminada"},null,null,{"$f":"VLOOKUP(A355,ZonasPagasVigentes!$D:$BA,68,FALSE)","v":{"$error":"#REF!"}}]
[418,"Activa",null,null,"2018-10-22"]
[419,"Activa",null,null,"2018-10-22"]
[420,"Activa",null,null,"2018-10-22"]
[421,"Eliminada",null,null,"2018-10-22"]
[422,"Activa",null,null,"2018-10-22"]
[423,"Eliminada",null,null,"2018-11-07"]
[424,"Activa",null,null,"2018-11-14"]
[425,"Activa",null,null,"2018-11-26"]
[426,"Suspendida ",null,null,"2018-12-15"]
[427,"Activa",null,null,"2018-12-27"]
[428,"Activa",null,null,"2019-01-30"]
[429,"Activa",null,null,"2019-01-30"]
[430,"Activa",null,null,"2019-01-30"]
[431,"Activa",null,null,"2019-01-31"]
[432,"Activa",null,null,"2007-10-29"]
[433,"Activa",null,null,"2019-02-18"]
[434,"Eliminada",null,null,"2019-02-20"]
[435,"Activa",null,null,"2019-02-20"]
[436,"Activa",null,null,"2019-02-20"]
[437,"Eliminada",null,null,"2019-02-20"]
[438,"Activa",null,null,"2019-02-22"]
[439,"Eliminada",null,null,"2019-02-22"]
[440,"Activa",null,null,"2019-03-01"]
[441,"Activa",null,null,"2019-03-01"]
[442,"Activa",null,null,"2019-03-21"]
[443,"Activa",null,null,"2019-04-01"]
[444,"Activa",null,null,"2019-04-03"]
[445,"Suspendida ",null,null,"2019-05-07"]
[446,"Activa",null,null,"2019-05-07"]
[447,"Activa",null,null,"2019-06-17"]
[448,"Activa",null,null,"2019-06-08"]
[449,"Activa",null,null,"2019-06-08"]
[450,"Activa",null,null,"2019-06-08"]
[451,"Activa",null,null,"2019-06-08"]
[452,"Activa",null,null,"2019-06-08"]
[453,"Activa",null,null,"2019-06-08"]
[454,"Eliminada",null,null,"2019-06-08"]
[455,"Activa",null,null,"2019-07-08"]
[456,"Eliminada",null,null,"2019-07-12"]
[457,"Suspendida ",null,null,"2019-07-12"]
[458,"Suspendida ",null,null,"2019-07-12"]
[459,"Eliminada",null,null,"2019-08-07"]
[460,"Activa",null,null,"2019-09-24"]
[461,"Activa",null,null,"2019-10-01"]
[462,"Activa",null,null,"2019-09-24"]
[463,"Activa",null,null,"2019-09-24"]
[464,"Activa",null,null,"2019-09-24"]
[465,"Activa",null,null,"2019-10-11"]
[466,"Activa",null,null,"2019-10-11"]
[467,"Activa",null,null,"2019-10-11"]
[468,"Activa",null,null,"2019-10-11"]
[469,"Activa",null,null,"2019-10-11"]
[470,"Activa",null,null,"2019-10-11"]
[471,"Activa",null,null,"2019-10-04"]
[472,"Activa",null,null,"2019-10-04"]
[473,"Activa",null,null,"2019-10-04"]
[474,"Activa",null,null,"2019-11-14"]
[475,"Activa"]
[476,"Espera "]
[477,"Espera "]
[478,"Espera "]
[479,"Espera "]
[480,"Espera "]
[481,"Espera "]
[482,"Espera "]
[483,"Espera "]
[484,"Espera "]
[485,"Espera "]
[486,"Espera "]
[487,"Espera "]
[488,"Espera "]
[489,"Espera "]
[490,"Espera "]
[491,"Espera "]
[492,"Espera "]
[493,"Espera "]
[494,"Espera "]
[495,"Espera "]
[496,"Espera "]
[497,"Espera "]
[498,"Espera "]
[499,"Espera "]
[500,"Espera ",null,null,"2019-10-28"]
[501,"Activa","Nueva ZP, inicia operación 29-11-2019",null,"2019-11-29"]
[502,"Activa","Nueva ZP, inicia operación 29-11-2020",null,"2019-11-29"]
[503,"Activa","Nueva ZP, inicia operación 29-11-2021",null,"2019-11-29"]
[504,"Activa","Nueva ZP, inicia operación 29-11-2022",null,"2019-11-29"]
[505,"Activa","Nueva ZP, inicia operación 29-11-2023",null,"2019-11-29"]
[506,"Activa","Nueva ZP, inicia operación 29-11-2024",null,"2019-11-29"]
[507,"Activa","Nueva ZP, inicia operación 29-11-2025",null,"2019-11-29"]
[508,"Activa","Nueva ZP, inicia operación 13-11-2019",null,"2019-11-13"]
[509,"Espera ","Nueva ZP, inica operación 13-11-2019",null,"2019-11-13"]
[510,"Espera ","Nueva ZP, inica operación 13-11-2020",null,"2019-11-13"]

{"sheet":"Historico","index":2,"n_rows":385,"n_cols":11,"rows_kept":385,"cut":false,"hidden":true,"merged":[]}
[]
["Tipo punto","Cod ZP","Estado ","Comentario ","Tipo de Día en que Opera","Inicio de Operación Laboral","Fin Operación Laboral","Inicio de Operación Sábado","Fin Operación Sábado","Inicio de Operación Domingo","Fin Operación Domingo"]
["ZP COMPARTIDA",1,{"$f":"INDEX(ZonasPagasVigentes!$B$2:$B$1048576,MATCH(B3,ZonasPagasVigentes!$D$2:$D$1048576,0))","v":"Activa"},"a partir del 08-11-2010 es compartida - optimiza horario de operación desde 01-06-2016",null,{"$f":"VLOOKUP(B3,ZonasPagasVigentes!$D:$BA,66,FALSE)","v":{"$error":"#REF!"}}]
["ZP COMPARTIDA",2,{"$f":"INDEX(ZonasPagasVigentes!$B$2:$B$1048576,MATCH(B4,ZonasPagasVigentes!$D$2:$D$1048576,0))","v":"Activa"},"a partir del 08-11-2010 es compartida - optimiza horario de operación desde 01-06-2016",null,{"$f":"VLOOKUP(B4,ZonasPagasVigentes!$D:$BA,66,FALSE)","v":{"$error":"#REF!"}}]
["ZP",3,{"$f":"INDEX(ZonasPagasVigentes!$B$2:$B$1048576,MATCH(B5,ZonasPagasVigentes!$D$2:$D$1048576,0))","v":"Activa"},"optimiza horario de operación desde 01-06-2016",null,{"$f":"VLOOKUP(B5,ZonasPagasVigentes!$D:$BA,66,FALSE)","v":{"$error":"#REF!"}}]
["ZP",4,{"$f":"INDEX(ZonasPagasVigentes!$B$2:$B$1048576,MATCH(B6,ZonasPagasVigentes!$D$2:$D$1048576,0))","v":"Eliminada"},"por análisis financiero desde 25-03-2016",null,{"$f":"VLOOKUP(B6,ZonasPagasVigentes!$D:$BA,66,FALSE)","v":{"$error":"#REF!"}},"2016-03-25"]
["ZP",5,{"$f":"INDEX(ZonasPagasVigentes!$B$2:$B$1048576,MATCH(B7,ZonasPagasVigentes!$D$2:$D$1048576,0))","v":"Eliminada"},"optimiza horario de operación desde 01-06-2016","Laboral",{"$f":"VLOOKUP(B7,ZonasPagasVigentes!$D:$BA,66,FALSE)","v":{"$error":"#REF!"}},"2018-08-31"]
["ZP",6,{"$f":"INDEX(ZonasPagasVigentes!$B$2:$B$1048576,MATCH(B8,ZonasPagasVigentes!$D$2:$D$1048576,0))","v":"Eliminada"},"optimiza horario de operación desde 01-06-2016",null,{"$f":"VLOOKUP(B8,ZonasPagasVigentes!$D:$BA,66,FALSE)","v":{"$error":"#REF!"}}]
["ZP",7,{"$f":"INDEX(ZonasPagasVigentes!$B$2:$B$1048576,MATCH(B9,ZonasPagasVigentes!$D$2:$D$1048576,0))","v":"Suspendida "},"Agrega 213eR y elimina 314eR PO 12-01-2019 cambia ZP a ZPM",null,{"$f":"VLOOKUP(B9,ZonasPagasVigentes!$D:$BA,66,FALSE)","v":{"$error":"#REF!"}}]
["ZP COMPARTIDA",8,{"$f":"INDEX(ZonasPagasVigentes!$B$2:$B$1048576,MATCH(B10,ZonasPagasVigentes!$D$2:$D$1048576,0))","v":"Eliminada"},"optimiza horario de operación desde 01-06-2016/ Desde 23-10-2018 deja de ser ZP Mixta porque servicio 106 pasa a express",null,{"$f":"VLOOKUP(B10,ZonasPagasVigentes!$D:$BA,66,FALSE)","v":{"$error":"#REF!"}}]
["ZP COMPARTIDA",9,{"$f":"INDEX(ZonasPagasVigentes!$B$2:$B$1048576,MATCH(B11,ZonasPagasVigentes!$D$2:$D$1048576,0))","v":"Eliminada"},"optimiza horario de operación desde 01-06-2016",null,{"$f":"VLOOKUP(B11,ZonasPagasVigentes!$D:$BA,66,FALSE)","v":{"$error":"#REF!"}},"2018-11-06"]
["ZP",10,{"$f":"INDEX(ZonasPagasVigentes!$B$2:$B$1048576,MATCH(B12,ZonasPagasVigentes!$D$2:$D$1048576,0))","v":"Eliminada"},"optimiza horario de operación desde 01-06-2016/ 31-07-2018 deja de operar y su horario es absorbido por la ZP371",null,{"$f":"VLOOKUP(B12,ZonasPagasVigentes!$D:$BA,66,FALSE)","v":{"$error":"#REF!"}},"2018-07-31"]
["ZP",11,{"$f":"INDEX(ZonasPagasVigentes!$B$2:$B$1048576,MATCH(B13,ZonasPagasVigentes!$D$2:$D$1048576,0))","v":"Eliminada"},"optimiza horario de operación desde 01-06-2016/  El 31-07-2018 deja de operar y su horario es absorbido por ZP285",null,{"$f":"VLOOKUP(B13,ZonasPagasVigentes!$D:$BA,66,FALSE)","v":{"$error":"#REF!"}},"2018-07-31"]
["ZP COMPARTIDA",12,{"$f":"INDEX(ZonasPagasVigentes!$B$2:$B$1048576,MATCH(B14,ZonasPagasVigentes!$D$2:$D$1048576,0))","v":"Activa"},"optimiza horario de operación desde 01-06-2016",null,{"$f":"VLOOKUP(B14,ZonasPagasVigentes!$D:$BA,66,FALSE)","v":{"$error":"#REF!"}}]
["ZP",13,{"$f":"INDEX(ZonasPagasVigentes!$B$2:$B$1048576,MATCH(B15,ZonasPagasVigentes!$D$2:$D$1048576,0))","v":"Activa"},null,null,{"$f":"VLOOKUP(B15,ZonasPagasVigentes!$D:$BA,66,FALSE)","v":{"$error":"#REF!"}}]
["ZP",14,{"$f":"INDEX(ZonasPagasVigentes!$B$2:$B$1048576,MATCH(B16,ZonasPagasVigentes!$D$2:$D$1048576,0))","v":"Eliminada"},"optimiza horario de operación desde 01-06-2016/ Desde 24-06-2018 opera domingo",null,{"$f":"VLOOKUP(B16,ZonasPagasVigentes!$D:$BA,66,FALSE)","v":{"$error":"#REF!"}}]
["ZP",15,{"$f":"INDEX(ZonasPagasVigentes!$B$2:$B$1048576,MATCH(B17,ZonasPagasVigentes!$D$2:$D$1048576,0))","v":"Activa"},"optimiza horario de operación desde 01-06-2016",null,{"$f":"VLOOKUP(B17,ZonasPagasVigentes!$D:$BA,66,FALSE)","v":{"$error":"#REF!"}}]
["ZP",16,{"$f":"INDEX(ZonasPagasVigentes!$B$2:$B$1048576,MATCH(B18,ZonasPagasVigentes!$D$2:$D$1048576,0))","v":"Eliminada"},"por análisis financiero desde 22-02-2016",null,{"$f":"VLOOKUP(B18,ZonasPagasVigentes!$D:$BA,66,FALSE)","v":{"$error":"#REF!"}},"2016-02-22"]
["ZP COMPARTIDA",17,{"$f":"INDEX(ZonasPagasVigentes!$B$2:$B$1048576,MATCH(B19,ZonasPagasVigentes!$D$2:$D$1048576,0))","v":"Activa"},"a partir del 08-11-2010 es compartida; elimina 201eR, 201cR y agrega 212cR PO 12-01-2019",null,{"$f":"VLOOKUP(B19,ZonasPagasVigentes!$D:$BA,66,FALSE)","v":{"$error":"#REF!"}}]
["ZP",18,{"$f":"INDEX(ZonasPagasVigentes!$B$2:$B$1048576,MATCH(B20,ZonasPagasVigentes!$D$2:$D$1048576,0))","v":"Eliminada"},"Es eliminada el 31-07-2018 y su horario es absorbido por ZP343",null,{"$f":"VLOOKUP(B20,ZonasPagasVigentes!$D:$BA,66,FALSE)","v":{"$error":"#REF!"}},"2018-07-31"]
["ZP",19,{"$f":"INDEX(ZonasPagasVigentes!$B$2:$B$1048576,MATCH(B21,ZonasPagasVigentes!$D$2:$D$1048576,0))","v":"Eliminada"},null,null,{"$f":"VLOOKUP(B21,ZonasPagasVigentes!$D:$BA,66,FALSE)","v":{"$error":"#REF!"}}]
["ZP",20,{"$f":"INDEX(ZonasPagasVigentes!$B$2:$B$1048576,MATCH(B22,ZonasPagasVigentes!$D$2:$D$1048576,0))","v":"Activa"},"optimiza horario de operación desde 01-06-2016",null,{"$f":"VLOOKUP(B22,ZonasPagasVigentes!$D:$BA,66,FALSE)","v":{"$error":"#REF!"}}]
["ZP COMPARTIDA",21,{"$f":"INDEX(ZonasPagasVigentes!$B$2:$B$1048576,MATCH(B23,ZonasPagasVigentes!$D$2:$D$1048576,0))","v":"Activa"},"a parti del 06-07-2015 - optimiza horario de operación desde 01-06-2016",null,{"$f":"VLOOKUP(B23,ZonasPagasVigentes!$D:$BA,66,FALSE)","v":{"$error":"#REF!"}}]
["ZP",22,{"$f":"INDEX(ZonasPagasVigentes!$B$2:$B$1048576,MATCH(B24,ZonasPagasVigentes!$D$2:$D$1048576,0))","v":"Activa"},null,null,{"$f":"VLOOKUP(B24,ZonasPagasVigentes!$D:$BA,66,FALSE)","v":{"$error":"#REF!"}}]
["ZP",23,{"$f":"INDEX(ZonasPagasVigentes!$B$2:$B$1048576,MATCH(B25,ZonasPagasVigentes!$D$2:$D$1048576,0))","v":"Eliminada"},"optimiza horario de operación desde 01-06-2016",null,{"$f":"VLOOKUP(B25,ZonasPagasVigentes!$D:$BA,66,FALSE)","v":{"$error":"#REF!"}}]
["ZP",26,{"$f":"INDEX(ZonasPagasVigentes!$B$2:$B$1048576,MATCH(B26,ZonasPagasVigentes!$D$2:$D$1048576,0))","v":"Eliminada"},"Elimina servicio 106I - 401I - 405I - 412I - 418I - 421I PO 12-01-2019",null,{"$f":"VLOOKUP(B26,ZonasPagasVigentes!$D:$BA,66,FALSE)","v":{"$error":"#REF!"}}]
["ZP",28,{"$f":"INDEX(ZonasPagasVigentes!$B$2:$B$1048576,MATCH(B27,ZonasPagasVigentes!$D$2:$D$1048576,0))","v":"Eliminada"},"optimiza horario de operación desde 01-06-2016",null,{"$f":"VLOOKUP(B27,ZonasPagasVigentes!$D:$BA,66,FALSE)","v":{"$error":"#REF!"}}]
["ZP COMPARTIDA",29,{"$f":"INDEX(ZonasPagasVigentes!$B$2:$B$1048576,MATCH(B28,ZonasPagasVigentes!$D$2:$D$1048576,0))","v":"Eliminada"},"según información operaciones 05,10,12 El 26-10-2013, se agrega provisoriamente 424R, por obras plaza de ciudadanía - optimiza horario de operación desde 01-06-2016",null,{"$f":"VLOOKUP(B28,ZonasPagasVigentes!$D:$BA,66,FALSE)","v":{"$error":"#REF!"}}]
["ZP",30,{"$f":"INDEX(ZonasPagasVigentes!$B$2:$B$1048576,MATCH(B29,ZonasPagasVigentes!$D$2:$D$1048576,0))","v":"Eliminada"},"por análisis financiero desde 25-03-2016 /se abre el 01-12-2017","Laboral",{"$f":"VLOOKUP(B29,ZonasPagasVigentes!$D:$BA,66,FALSE)","v":{"$error":"#REF!"}},"2018-08-31"]
["ZP COMPARTIDA",31,{"$f":"INDEX(ZonasPagasVigentes!$B$2:$B$1048576,MATCH(B30,ZonasPagasVigentes!$D$2:$D$1048576,0))","v":"Suspendida "},"optimiza horario de operación desde 01-06-2016",null,{"$f":"VLOOKUP(B30,ZonasPagasVigentes!$D:$BA,66,FALSE)","v":{"$error":"#REF!"}},null,"2018-11-10",null,"2018-11-11"]
["ZP",32,{"$f":"INDEX(ZonasPagasVigentes!$B$2:$B$1048576,MATCH(B31,ZonasPagasVigentes!$D$2:$D$1048576,0))","v":"Eliminada"},"desde el 24-06-2018 opera día domingo/ El día 12-07-2018 pasa de operar con 3 validadores a operar con 2",null,{"$f":"VLOOKUP(B31,ZonasPagasVigentes!$D:$BA,66,FALSE)","v":{"$error":"#REF!"}}]
["ZP",33,{"$f":"INDEX(ZonasPagasVigentes!$B$2:$B$1048576,MATCH(B32,ZonasPagasVigentes!$D$2:$D$1048576,0))","v":"Eliminada"},"optimiza horario de operación desde 01-06-2016; Agrega PM 422I 12-01-2019",null,{"$f":"VLOOKUP(B32,ZonasPagasVigentes!$D:$BA,66,FALSE)","v":{"$error":"#REF!"}}]
["ZP",34,{"$f":"INDEX(ZonasPagasVigentes!$B$2:$B$1048576,MATCH(B33,ZonasPagasVigentes!$D$2:$D$1048576,0))","v":"Eliminada"},"por análisis financiero desde 22-02-2016/ vuelve a operar desde 01-12-2017; Termino OP 31-08-218","Laboral",{"$f":"VLOOKUP(B33,ZonasPagasVigentes!$D:$BA,66,FALSE)","v":{"$error":"#REF!"}},"2018-08-31"]
["ZP",35,{"$f":"INDEX(ZonasPagasVigentes!$B$2:$B$1048576,MATCH(B34,ZonasPagasVigentes!$D$2:$D$1048576,0))","v":"Eliminada"},"optimiza horario de operación desde 01-06-2016",null,{"$f":"VLOOKUP(B34,ZonasPagasVigentes!$D:$BA,66,FALSE)","v":{"$error":"#REF!"}}]
["ZP COMPARTIDA",36,{"$f":"INDEX(ZonasPagasVigentes!$B$2:$B$1048576,MATCH(B35,ZonasPagasVigentes!$D$2:$D$1048576,0))","v":"Eliminada"},"C10e a partir del 06-01-2010 al 02-02-2015 117 a partir de 06-07-2009/ El 01-12-2017 comienza a operar en PTA; agrega 429cI ,  PO 12-01-2019 PT",null,{"$f":"VLOOKUP(B35,ZonasPagasVigentes!$D:$BA,66,FALSE)","v":{"$error":"#REF!"}}]
["ZP COMPARTIDA",38,{"$f":"INDEX(ZonasPagasVigentes!$B$2:$B$1048576,MATCH(B36,ZonasPagasVigentes!$D$2:$D$1048576,0))","v":"Eliminada"},"desde 01-12-2015 comienza a operar como mixta porque servicio 213e pasa a U7 - optimiza horario de operación desde 01-06-2016","Laboral",{"$f":"VLOOKUP(B36,ZonasPagasVigentes!$D:$BA,66,FALSE)","v":{"$error":"#REF!"}},"2018-08-31"]
["ZP",40,{"$f":"INDEX(ZonasPagasVigentes!$B$2:$B$1048576,MATCH(B37,ZonasPagasVigentes!$D$2:$D$1048576,0))","v":"Eliminada"},"por análisis financiero desde 25-03-2016",null,{"$f":"VLOOKUP(B37,ZonasPagasVigentes!$D:$BA,66,FALSE)","v":{"$error":"#REF!"}},"2016-03-25"]
["ZP",41,{"$f":"INDEX(ZonasPagasVigentes!$B$2:$B$1048576,MATCH(B38,ZonasPagasVigentes!$D$2:$D$1048576,0))","v":"Eliminada"},"optimiza horario de operación desde 01-06-2016/ El 31-07-2018 deja de operar y su horario es absorvido por ZP284",null,{"$f":"VLOOKUP(B38,ZonasPagasVigentes!$D:$BA,66,FALSE)","v":{"$error":"#REF!"}},"2018-07-31"]
["ZP",43,{"$f":"INDEX(ZonasPagasVigentes!$B$2:$B$1048576,MATCH(B39,ZonasPagasVigentes!$D$2:$D$1048576,0))","v":"Eliminada"},"por análisis financiero desde 22-02-2016",null,{"$f":"VLOOKUP(B39,ZonasPagasVigentes!$D:$BA,66,FALSE)","v":{"$error":"#REF!"}},"2016-02-22"]
["ZP",44,{"$f":"INDEX(ZonasPagasVigentes!$B$2:$B$1048576,MATCH(B40,ZonasPagasVigentes!$D$2:$D$1048576,0))","v":"Activa"},null,null,{"$f":"VLOOKUP(B40,ZonasPagasVigentes!$D:$BA,66,FALSE)","v":{"$error":"#REF!"}}]
["ZP",45,{"$f":"INDEX(ZonasPagasVigentes!$B$2:$B$1048576,MATCH(B41,ZonasPagasVigentes!$D$2:$D$1048576,0))","v":"Activa"},null,null,{"$f":"VLOOKUP(B41,ZonasPagasVigentes!$D:$BA,66,FALSE)","v":{"$error":"#REF!"}}]
["ZP",47,{"$f":"INDEX(ZonasPagasVigentes!$B$2:$B$1048576,MATCH(B42,ZonasPagasVigentes!$D$2:$D$1048576,0))","v":"Activa"},null,null,{"$f":"VLOOKUP(B42,ZonasPagasVigentes!$D:$BA,66,FALSE)","v":{"$error":"#REF!"}}]
["ZP",48,{"$f":"INDEX(ZonasPagasVigentes!$B$2:$B$1048576,MATCH(B43,ZonasPagasVigentes!$D$2:$D$1048576,0))","v":"Eliminada"},"por análisis financiero desde 25-03-2016/ se abre el 01-12-2017","Laboral",{"$f":"VLOOKUP(B43,ZonasPagasVigentes!$D:$BA,66,FALSE)","v":{"$error":"#REF!"}},"2018-08-31"]
["ZP COMPARTIDA",49,{"$f":"INDEX(ZonasPagasVigentes!$B$2:$B$1048576,MATCH(B44,ZonasPagasVigentes!$D$2:$D$1048576,0))","v":"Eliminada"},"desde 28,03,2014 por inclusión unidad 3. El 20,05,2014 deja operar I13 - optimiza horario de operación desde 01-06-2016",null,{"$f":"VLOOKUP(B44,ZonasPagasVigentes!$D:$BA,66,FALSE)","v":{"$error":"#REF!"}}]
["ZP",51,{"$f":"INDEX(ZonasPagasVigentes!$B$2:$B$1048576,MATCH(B45,ZonasPagasVigentes!$D$2:$D$1048576,0))","v":"Eliminada"},"por análisis financiero desde 22-02-2016",null,{"$f":"VLOOKUP(B45,ZonasPagasVigentes!$D:$BA,66,FALSE)","v":{"$error":"#REF!"}},"2016-02-22"]
["ZP",52,{"$f":"INDEX(ZonasPagasVigentes!$B$2:$B$1048576,MATCH(B46,ZonasPagasVigentes!$D$2:$D$1048576,0))","v":"Eliminada"},"Se elimina el 31-07-2018 y su horario es absorbido por ZP382",null,{"$f":"VLOOKUP(B46,ZonasPagasVigentes!$D:$BA,66,FALSE)","v":{"$error":"#REF!"}},"2018-07-31"]
["ZP",53,{"$f":"INDEX(ZonasPagasVigentes!$B$2:$B$1048576,MATCH(B47,ZonasPagasVigentes!$D$2:$D$1048576,0))","v":"Eliminada"},"Eliminada desde 01-06-2016",null,{"$f":"VLOOKUP(B47,ZonasPagasVigentes!$D:$BA,66,FALSE)","v":{"$error":"#REF!"}},"2016-07-01"]
["ZP",54,{"$f":"INDEX(ZonasPagasVigentes!$B$2:$B$1048576,MATCH(B48,ZonasPagasVigentes!$D$2:$D$1048576,0))","v":"Activa"},"optimiza horario de operación desde 01-06-2016/ Agrega horario PMA el 10-09-2018",null,{"$f":"VLOOKUP(B48,ZonasPagasVigentes!$D:$BA,66,FALSE)","v":{"$error":"#REF!"}}]
["ZP",55,{"$f":"INDEX(ZonasPagasVigentes!$B$2:$B$1048576,MATCH(B49,ZonasPagasVigentes!$D$2:$D$1048576,0))","v":"Suspendida "},"optimiza horario de operación desde 01-06-2016",null,{"$f":"VLOOKUP(B49,ZonasPagasVigentes!$D:$BA,66,FALSE)","v":{"$error":"#REF!"}}]
["ZP",56,{"$f":"INDEX(ZonasPagasVigentes!$B$2:$B$1048576,MATCH(B50,ZonasPagasVigentes!$D$2:$D$1048576,0))","v":"Eliminada"},"Eliminada desde 01-06-2016",null,{"$f":"VLOOKUP(B50,ZonasPagasVigentes!$D:$BA,66,FALSE)","v":{"$error":"#REF!"}},"2016-07-01"]
["ZP",57,{"$f":"INDEX(ZonasPagasVigentes!$B$2:$B$1048576,MATCH(B51,ZonasPagasVigentes!$D$2:$D$1048576,0))","v":"Eliminada"},"Deja de operar el 31-07-2018 y su operación es absorbida por Z296",null,{"$f":"VLOOKUP(B51,ZonasPagasVigentes!$D:$BA,66,FALSE)","v":{"$error":"#REF!"}},"2018-07-31"]
["ZP",58,{"$f":"INDEX(ZonasPagasVigentes!$B$2:$B$1048576,MATCH(B52,ZonasPagasVigentes!$D$2:$D$1048576,0))","v":"Eliminada"},"Eliminada desde 01-06-2016",null,{"$f":"VLOOKUP(B52,ZonasPagasVigentes!$D:$BA,66,FALSE)","v":{"$error":"#REF!"}},"2016-06-01"]
["ZP",59,{"$f":"INDEX(ZonasPagasVigentes!$B$2:$B$1048576,MATCH(B53,ZonasPagasVigentes!$D$2:$D$1048576,0))","v":"Eliminada"},null,null,{"$f":"VLOOKUP(B53,ZonasPagasVigentes!$D:$BA,66,FALSE)","v":{"$error":"#REF!"}}]
["ZP",60,{"$f":"INDEX(ZonasPagasVigentes!$B$2:$B$1048576,MATCH(B54,ZonasPagasVigentes!$D$2:$D$1048576,0))","v":"Eliminada"},"optimiza horario de operación desde 01-06-2016; Cierre de ZP, a partir del 28-01-2019",null,{"$f":"VLOOKUP(B54,ZonasPagasVigentes!$D:$BA,66,FALSE)","v":{"$error":"#REF!"}}]
["ZP",61,{"$f":"INDEX(ZonasPagasVigentes!$B$2:$B$1048576,MATCH(B55,ZonasPagasVigentes!$D$2:$D$1048576,0))","v":"Eliminada"},"Es eliminada el 31-07-2018 y su horario es absorbido por ZP239",null,{"$f":"VLOOKUP(B55,ZonasPagasVigentes!$D:$BA,66,FALSE)","v":{"$error":"#REF!"}},"2018-07-31"]
["ZP",62,{"$f":"INDEX(ZonasPagasVigentes!$B$2:$B$1048576,MATCH(B56,ZonasPagasVigentes!$D$2:$D$1048576,0))","v":"Eliminada"},"por análisis financiero desde 22-02-2016",null,{"$f":"VLOOKUP(B56,ZonasPagasVigentes!$D:$BA,66,FALSE)","v":{"$error":"#REF!"}},"2016-02-22"]
["ZP",63,{"$f":"INDEX(ZonasPagasVigentes!$B$2:$B$1048576,MATCH(B57,ZonasPagasVigentes!$D$2:$D$1048576,0))","v":"Eliminada"},"por análisis financiero desde 25-03-2016",null,{"$f":"VLOOKUP(B57,ZonasPagasVigentes!$D:$BA,66,FALSE)","v":{"$error":"#REF!"}},"2016-03-25"]
["ZP",64,{"$f":"INDEX(ZonasPagasVigentes!$B$2:$B$1048576,MATCH(B58,ZonasPagasVigentes!$D$2:$D$1048576,0))","v":"Eliminada"},"por análisis financiero desde 22-02-2016",null,{"$f":"VLOOKUP(B58,ZonasPagasVigentes!$D:$BA,66,FALSE)","v":{"$error":"#REF!"}},"2016-02-22"]
["ZP",65,{"$f":"INDEX(ZonasPagasVigentes!$B$2:$B$1048576,MATCH(B59,ZonasPagasVigentes!$D$2:$D$1048576,0))","v":"Eliminada"},"Sin TRX deja de operar el 30-11-2015",null,{"$f":"VLOOKUP(B59,ZonasPagasVigentes!$D:$BA,66,FALSE)","v":{"$error":"#REF!"}},"2015-12-01"]
["ZP",66,{"$f":"INDEX(ZonasPagasVigentes!$B$2:$B$1048576,MATCH(B60,ZonasPagasVigentes!$D$2:$D$1048576,0))","v":"Activa"},"optimiza horario de operación desde 01-06-2016",null,{"$f":"VLOOKUP(B60,ZonasPagasVigentes!$D:$BA,66,FALSE)","v":{"$error":"#REF!"}}]
["ZP",67,{"$f":"INDEX(ZonasPagasVigentes!$B$2:$B$1048576,MATCH(B61,ZonasPagasVigentes!$D$2:$D$1048576,0))","v":"Eliminada"},"Eliminada desde 01-06-2016",null,{"$f":"VLOOKUP(B61,ZonasPagasVigentes!$D:$BA,66,FALSE)","v":{"$error":"#REF!"}},"2016-07-01"]
["ZP",68,{"$f":"INDEX(ZonasPagasVigentes!$B$2:$B$1048576,MATCH(B62,ZonasPagasVigentes!$D$2:$D$1048576,0))","v":"Eliminada"},"por análisis financiero desde 25-03-2016",null,{"$f":"VLOOKUP(B62,ZonasPagasVigentes!$D:$BA,66,FALSE)","v":{"$error":"#REF!"}},"2016-03-25"]
["ZP",69,{"$f":"INDEX(ZonasPagasVigentes!$B$2:$B$1048576,MATCH(B63,ZonasPagasVigentes!$D$2:$D$1048576,0))","v":"Eliminada"},"TEMPORALMENTE POR OBRAS A PARTIR DEL 06 DE NOVIEMBRE\nno es ZPC según información operaciones del 05,10,12\nEliminada 01-06-2016",null,{"$f":"VLOOKUP(B63,ZonasPagasVigentes!$D:$BA,66,FALSE)","v":{"$error":"#REF!"}},"2016-06-01"]
["ZP",70,{"$f":"INDEX(ZonasPagasVigentes!$B$2:$B$1048576,MATCH(B64,ZonasPagasVigentes!$D$2:$D$1048576,0))","v":"Eliminada"},"por análisis financiero desde 25-03-2016/ se abre el 01-12-2017",null,{"$f":"VLOOKUP(B64,ZonasPagasVigentes!$D:$BA,66,FALSE)","v":{"$error":"#REF!"}}]
["N/A",71,{"$f":"INDEX(ZonasPagasVigentes!$B$2:$B$1048576,MATCH(B65,ZonasPagasVigentes!$D$2:$D$1048576,0))","v":"Eliminada"},"Sin TRX",null,{"$f":"VLOOKUP(B65,ZonasPagasVigentes!$D:$BA,66,FALSE)","v":{"$error":"#REF!"}},"2011-05-23"]
["ZP",72,{"$f":"INDEX(ZonasPagasVigentes!$B$2:$B$1048576,MATCH(B66,ZonasPagasVigentes!$D$2:$D$1048576,0))","v":"Activa"},"optimiza horario de operación desde 01-06-2016",null,{"$f":"VLOOKUP(B66,ZonasPagasVigentes!$D:$BA,66,FALSE)","v":{"$error":"#REF!"}}]
["ZP",73,{"$f":"INDEX(ZonasPagasVigentes!$B$2:$B$1048576,MATCH(B67,ZonasPagasVigentes!$D$2:$D$1048576,0))","v":"Activa"},"optimiza horario de operación desde 01-06-2016",null,{"$f":"VLOOKUP(B67,ZonasPagasVigentes!$D:$BA,66,FALSE)","v":{"$error":"#REF!"}}]
["ZP COMPARTIDA",74,{"$f":"INDEX(ZonasPagasVigentes!$B$2:$B$1048576,MATCH(B68,ZonasPagasVigentes!$D$2:$D$1048576,0))","v":"Eliminada"},"según información operaciones 05,10,12\nEl 26-10-2013, se agrega provisoriamente 424R, por obras plaza de ciudadanía - optimiza horario de operación desde 01-06-2016",null,{"$f":"VLOOKUP(B68,ZonasPagasVigentes!$D:$BA,66,FALSE)","v":{"$error":"#REF!"}}]
["ZP",75,{"$f":"INDEX(ZonasPagasVigentes!$B$2:$B$1048576,MATCH(B69,ZonasPagasVigentes!$D$2:$D$1048576,0))","v":"Eliminada"},"Se elimina el 31-07-2018 y su horario es absorbido por ZP396",null,{"$f":"VLOOKUP(B69,ZonasPagasVigentes!$D:$BA,66,FALSE)","v":{"$error":"#REF!"}},"2018-07-31"]
["ZP COMPARTIDA",78,{"$f":"INDEX(ZonasPagasVigentes!$B$2:$B$1048576,MATCH(B70,ZonasPagasVigentes!$D$2:$D$1048576,0))","v":"Eliminada"},"A partir de 10-02-2010 compartida - optimiza horario de operación desde 01-06-2016",null,{"$f":"VLOOKUP(B70,ZonasPagasVigentes!$D:$BA,66,FALSE)","v":{"$error":"#REF!"}}]
["ZP",79,{"$f":"INDEX(ZonasPagasVigentes!$B$2:$B$1048576,MATCH(B71,ZonasPagasVigentes!$D$2:$D$1048576,0))","v":"Eliminada"},null,null,{"$f":"VLOOKUP(B71,ZonasPagasVigentes!$D:$BA,66,FALSE)","v":{"$error":"#REF!"}}]
["ZP",80,{"$f":"INDEX(ZonasPagasVigentes!$B$2:$B$1048576,MATCH(B72,ZonasPagasVigentes!$D$2:$D$1048576,0))","v":"Eliminada"},"por análisis financiero desde 25-03-2016",null,{"$f":"VLOOKUP(B72,ZonasPagasVigentes!$D:$BA,66,FALSE)","v":{"$error":"#REF!"}},"2016-03-25"]
["ZP",82,{"$f":"INDEX(ZonasPagasVigentes!$B$2:$B$1048576,MATCH(B73,ZonasPagasVigentes!$D$2:$D$1048576,0))","v":"Eliminada"},"Eliminada desde 01-06-2016",null,{"$f":"VLOOKUP(B73,ZonasPagasVigentes!$D:$BA,66,FALSE)","v":{"$error":"#REF!"}},"2016-07-01"]
["ZP",83,{"$f":"INDEX(ZonasPagasVigentes!$B$2:$B$1048576,MATCH(B74,ZonasPagasVigentes!$D$2:$D$1048576,0))","v":"Activa"},"optimiza horario de operación desde 01-06-2016",null,{"$f":"VLOOKUP(B74,ZonasPagasVigentes!$D:$BA,66,FALSE)","v":{"$error":"#REF!"}}]
["N/A",85,{"$f":"INDEX(ZonasPagasVigentes!$B$2:$B$1048576,MATCH(B75,ZonasPagasVigentes!$D$2:$D$1048576,0))","v":"Eliminada"},"Sin TRX",null,{"$f":"VLOOKUP(B75,ZonasPagasVigentes!$D:$BA,66,FALSE)","v":{"$error":"#REF!"}},"2011-05-23"]
["ZP COMPARTIDA",86,{"$f":"INDEX(ZonasPagasVigentes!$B$2:$B$1048576,MATCH(B76,ZonasPagasVigentes!$D$2:$D$1048576,0))","v":"Eliminada"},"Sin TRX deja de operar el 30-11-2015",null,{"$f":"VLOOKUP(B76,ZonasPagasVigentes!$D:$BA,66,FALSE)","v":{"$error":"#REF!"}},"2015-12-01"]
["ZP",87,{"$f":"INDEX(ZonasPagasVigentes!$B$2:$B$1048576,MATCH(B77,ZonasPagasVigentes!$D$2:$D$1048576,0))","v":"Activa"},null,null,{"$f":"VLOOKUP(B77,ZonasPagasVigentes!$D:$BA,66,FALSE)","v":{"$error":"#REF!"}}]
["ZP COMPARTIDA",90,{"$f":"INDEX(ZonasPagasVigentes!$B$2:$B$1048576,MATCH(B78,ZonasPagasVigentes!$D$2:$D$1048576,0))","v":"Activa"},"A partir 12,01,2013 a partir del 04-10-2013 deja de operar 517\nA partir del 07-09-2015, se vuelve mixta sin estar oficializada en Consolidado de Paradas\noptimiza horario de operación desde 01-06-2016/ El 01-12-2017 comienza a operar en PTA",null,{"$f":"VLOOKUP(B78,ZonasPagasVigentes!$D:$BA,66,FALSE)","v":{"$error":"#REF!"}}]
["ZP",91,{"$f":"INDEX(ZonasPagasVigentes!$B$2:$B$1048576,MATCH(B79,ZonasPagasVigentes!$D$2:$D$1048576,0))","v":"Activa"},null,null,{"$f":"VLOOKUP(B79,ZonasPagasVigentes!$D:$BA,66,FALSE)","v":{"$error":"#REF!"}}]
["ZP",93,{"$f":"INDEX(ZonasPagasVigentes!$B$2:$B$1048576,MATCH(B80,ZonasPagasVigentes!$D$2:$D$1048576,0))","v":"Eliminada"},"por análisis financiero desde 25-03-2016",null,{"$f":"VLOOKUP(B80,ZonasPagasVigentes!$D:$BA,66,FALSE)","v":{"$error":"#REF!"}},"2016-03-25"]
["ZP",94,{"$f":"INDEX(ZonasPagasVigentes!$B$2:$B$1048576,MATCH(B81,ZonasPagasVigentes!$D$2:$D$1048576,0))","v":"Suspendida "},null,null,{"$f":"VLOOKUP(B81,ZonasPagasVigentes!$D:$BA,66,FALSE)","v":{"$error":"#REF!"}}]
["ZP",96,{"$f":"INDEX(ZonasPagasVigentes!$B$2:$B$1048576,MATCH(B82,ZonasPagasVigentes!$D$2:$D$1048576,0))","v":"Eliminada"},"optimiza horario de operación desde 01-06-2016",null,{"$f":"VLOOKUP(B82,ZonasPagasVigentes!$D:$BA,66,FALSE)","v":{"$error":"#REF!"}}]
["ZP",97,{"$f":"INDEX(ZonasPagasVigentes!$B$2:$B$1048576,MATCH(B83,ZonasPagasVigentes!$D$2:$D$1048576,0))","v":"Eliminada"},"por análisis financiero desde 22-02-2016",null,{"$f":"VLOOKUP(B83,ZonasPagasVigentes!$D:$BA,66,FALSE)","v":{"$error":"#REF!"}},"2016-02-22"]
["ZP COMPARTIDA",98,{"$f":"INDEX(ZonasPagasVigentes!$B$2:$B$1048576,MATCH(B84,ZonasPagasVigentes!$D$2:$D$1048576,0))","v":"Eliminada"},"a partir 05-10-2013 empieza operar H05c - optimiza horario de operación desde 01-06-2016",null,{"$f":"VLOOKUP(B84,ZonasPagasVigentes!$D:$BA,66,FALSE)","v":{"$error":"#REF!"}}]
["ZP",99,{"$f":"INDEX(ZonasPagasVigentes!$B$2:$B$1048576,MATCH(B85,ZonasPagasVigentes!$D$2:$D$1048576,0))","v":"Eliminada"},"por análisis financiero desde 22-02-2016",null,{"$f":"VLOOKUP(B85,ZonasPagasVigentes!$D:$BA,66,FALSE)","v":{"$error":"#REF!"}},"2016-02-22"]
["ZP",101,{"$f":"INDEX(ZonasPagasVigentes!$B$2:$B$1048576,MATCH(B86,ZonasPagasVigentes!$D$2:$D$1048576,0))","v":"Eliminada"},"por análisis financiero desde 22-02-2016",null,{"$f":"VLOOKUP(B86,ZonasPagasVigentes!$D:$BA,66,FALSE)","v":{"$error":"#REF!"}},"2016-02-22"]
["ZP",102,{"$f":"INDEX(ZonasPagasVigentes!$B$2:$B$1048576,MATCH(B87,ZonasPagasVigentes!$D$2:$D$1048576,0))","v":"Activa"},"Elimina servicio I12R - I24R PO 12-01-2019",null,{"$f":"VLOOKUP(B87,ZonasPagasVigentes!$D:$BA,66,FALSE)","v":{"$error":"#REF!"}}]
["ZP",105,{"$f":"INDEX(ZonasPagasVigentes!$B$2:$B$1048576,MATCH(B88,ZonasPagasVigentes!$D$2:$D$1048576,0))","v":"Eliminada"},"por análisis financiero desde 22-02-2016",null,{"$f":"VLOOKUP(B88,ZonasPagasVigentes!$D:$BA,66,FALSE)","v":{"$error":"#REF!"}},"2016-02-22"]
["ZP",106,{"$f":"INDEX(ZonasPagasVigentes!$B$2:$B$1048576,MATCH(B89,ZonasPagasVigentes!$D$2:$D$1048576,0))","v":"Eliminada"},"por análisis financiero desde 22-02-2016",null,{"$f":"VLOOKUP(B89,ZonasPagasVigentes!$D:$BA,66,FALSE)","v":{"$error":"#REF!"}},"2016-02-22"]
["ZP",108,{"$f":"INDEX(ZonasPagasVigentes!$B$2:$B$1048576,MATCH(B90,ZonasPagasVigentes!$D$2:$D$1048576,0))","v":"Activa"},"optimiza horario de operación desde 01-06-2016",null,{"$f":"VLOOKUP(B90,ZonasPagasVigentes!$D:$BA,66,FALSE)","v":{"$error":"#REF!"}}]
["N/A",109,{"$f":"INDEX(ZonasPagasVigentes!$B$2:$B$1048576,MATCH(B91,ZonasPagasVigentes!$D$2:$D$1048576,0))","v":"Eliminada"},"Sin TRX",null,{"$f":"VLOOKUP(B91,ZonasPagasVigentes!$D:$BA,66,FALSE)","v":{"$error":"#REF!"}},"2011-05-23"]
["ZPF COMPARTIDA",110,{"$f":"INDEX(ZonasPagasVigentes!$B$2:$B$1048576,MATCH(B92,ZonasPagasVigentes!$D$2:$D$1048576,0))","v":"Eliminada"},"Inicio operaciones 12-11-2013",null,{"$f":"VLOOKUP(B92,ZonasPagasVigentes!$D:$BA,66,FALSE)","v":{"$error":"#REF!"}}]
["ZPF COMPARTIDA",111,{"$f":"INDEX(ZonasPagasVigentes!$B$2:$B$1048576,MATCH(B93,ZonasPagasVigentes!$D$2:$D$1048576,0))","v":"Eliminada"},"Inicio operaciones 12-11-2013",null,{"$f":"VLOOKUP(B93,ZonasPagasVigentes!$D:$BA,66,FALSE)","v":{"$error":"#REF!"}}]
["ZP",112,{"$f":"INDEX(ZonasPagasVigentes!$B$2:$B$1048576,MATCH(B94,ZonasPagasVigentes!$D$2:$D$1048576,0))","v":"Activa"},"optimiza horario de operación desde 01-06-2016",null,{"$f":"VLOOKUP(B94,ZonasPagasVigentes!$D:$BA,66,FALSE)","v":{"$error":"#REF!"}}]
["ZP",115,{"$f":"INDEX(ZonasPagasVigentes!$B$2:$B$1048576,MATCH(B95,ZonasPagasVigentes!$D$2:$D$1048576,0))","v":"Eliminada"},"Eliminada 01-06-2016",null,{"$f":"VLOOKUP(B95,ZonasPagasVigentes!$D:$BA,66,FALSE)","v":{"$error":"#REF!"}},"2016-06-01"]
["ZPM",116,{"$f":"INDEX(ZonasPagasVigentes!$B$2:$B$1048576,MATCH(B96,ZonasPagasVigentes!$D$2:$D$1048576,0))","v":"Eliminada"},"optimiza horario de operación desde 01-06-2016 - desde 02-07-2016 opera como ZPM agrega B27",null,{"$f":"VLOOKUP(B96,ZonasPagasVigentes!$D:$BA,66,FALSE)","v":{"$error":"#REF!"}}]
["ZPF",117,{"$f":"INDEX(ZonasPagasVigentes!$B$2:$B$1048576,MATCH(B97,ZonasPagasVigentes!$D$2:$D$1048576,0))","v":"Eliminada"},"se retiran 2 validadores el 21-12-2011",null,{"$f":"VLOOKUP(B97,ZonasPagasVigentes!$D:$BA,66,FALSE)","v":{"$error":"#REF!"}},"2017-10-06"]
["ZPF",118,{"$f":"INDEX(ZonasPagasVigentes!$B$2:$B$1048576,MATCH(B98,ZonasPagasVigentes!$D$2:$D$1048576,0))","v":"Activa"},null,null,{"$f":"VLOOKUP(B98,ZonasPagasVigentes!$D:$BA,66,FALSE)","v":{"$error":"#REF!"}}]
["ZPF",119,{"$f":"INDEX(ZonasPagasVigentes!$B$2:$B$1048576,MATCH(B99,ZonasPagasVigentes!$D$2:$D$1048576,0))","v":"Activa"},null,null,{"$f":"VLOOKUP(B99,ZonasPagasVigentes!$D:$BA,66,FALSE)","v":{"$error":"#REF!"}}]
["ZP COMPARTIDA",120,{"$f":"INDEX(ZonasPagasVigentes!$B$2:$B$1048576,MATCH(B100,ZonasPagasVigentes!$D$2:$D$1048576,0))","v":"Eliminada"},"se convierte en mixta el 18-01-2014/ Se elimina el 31-07-2018 y su horario es absorbido por ZP395",null,{"$f":"VLOOKUP(B100,ZonasPagasVigentes!$D:$BA,66,FALSE)","v":{"$error":"#REF!"}},"2018-07-31"]
["ZP",121,{"$f":"INDEX(ZonasPagasVigentes!$B$2:$B$1048576,MATCH(B101,ZonasPagasVigentes!$D$2:$D$1048576,0))","v":"Eliminada"},"optimiza horario de operación desde 01-06-2016/ Se elimina el 31-07-2018 y su horario es absorbido por ZP393",null,{"$f":"VLOOKUP(B101,ZonasPagasVigentes!$D:$BA,66,FALSE)","v":{"$error":"#REF!"}},"2018-07-31"]
["ZP",122,{"$f":"INDEX(ZonasPagasVigentes!$B$2:$B$1048576,MATCH(B102,ZonasPagasVigentes!$D$2:$D$1048576,0))","v":"Suspendida "},null,null,{"$f":"VLOOKUP(B102,ZonasPagasVigentes!$D:$BA,66,FALSE)","v":{"$error":"#REF!"}}]
["ZP",124,{"$f":"INDEX(ZonasPagasVigentes!$B$2:$B$1048576,MATCH(B103,ZonasPagasVigentes!$D$2:$D$1048576,0))","v":"Eliminada"},"por análisis financiero desde 25-03-2016",null,{"$f":"VLOOKUP(B103,ZonasPagasVigentes!$D:$BA,66,FALSE)","v":{"$error":"#REF!"}},"2016-03-25"]
["ZP",127,{"$f":"INDEX(ZonasPagasVigentes!$B$2:$B$1048576,MATCH(B104,ZonasPagasVigentes!$D$2:$D$1048576,0))","v":"Eliminada"},null,null,{"$f":"VLOOKUP(B104,ZonasPagasVigentes!$D:$BA,66,FALSE)","v":{"$error":"#REF!"}}]
["ZP",136,{"$f":"INDEX(ZonasPagasVigentes!$B$2:$B$1048576,MATCH(B105,ZonasPagasVigentes!$D$2:$D$1048576,0))","v":"Activa"},"Desde 02 de Julio cambia cód de parada ya que se traslada por modificación de trazado 303e",null,{"$f":"VLOOKUP(B105,ZonasPagasVigentes!$D:$BA,66,FALSE)","v":{"$error":"#REF!"}}]
["ZP",144,{"$f":"INDEX(ZonasPagasVigentes!$B$2:$B$1048576,MATCH(B106,ZonasPagasVigentes!$D$2:$D$1048576,0))","v":"Eliminada"},"Sin TRX por descoordinación con Infraestructura, Constructora la sacó",null,{"$f":"VLOOKUP(B106,ZonasPagasVigentes!$D:$BA,66,FALSE)","v":{"$error":"#REF!"}},"2015-12-01"]
["N/A",146,{"$f":"INDEX(ZonasPagasVigentes!$B$2:$B$1048576,MATCH(B107,ZonasPagasVigentes!$D$2:$D$1048576,0))","v":"Eliminada"},"Sin TRX deja de operar el 30-09-2013",null,{"$f":"VLOOKUP(B107,ZonasPagasVigentes!$D:$BA,66,FALSE)","v":{"$error":"#REF!"}},"2013-10-25"]
["ZP",147,{"$f":"INDEX(ZonasPagasVigentes!$B$2:$B$1048576,MATCH(B108,ZonasPagasVigentes!$D$2:$D$1048576,0))","v":"Eliminada"},"optimiza horario de operación desde 01-06-2016/ deja de operar el 31-07-2018 su horario es absorbido por ZP381",null,{"$f":"VLOOKUP(B108,ZonasPagasVigentes!$D:$BA,66,FALSE)","v":{"$error":"#REF!"}},"2018-07-31"]
["N/A",148,{"$f":"INDEX(ZonasPagasVigentes!$B$2:$B$1048576,MATCH(B109,ZonasPagasVigentes!$D$2:$D$1048576,0))","v":"Eliminada"},"Sin TRX",null,{"$f":"VLOOKUP(B109,ZonasPagasVigentes!$D:$BA,66,FALSE)","v":{"$error":"#REF!"}},"2011-05-23"]
["ZP COMPARTIDA",149,{"$f":"INDEX(ZonasPagasVigentes!$B$2:$B$1048576,MATCH(B110,ZonasPagasVigentes!$D$2:$D$1048576,0))","v":"Eliminada"},"optimiza horario de operación desde 01-06-2016","Laboral",{"$f":"VLOOKUP(B110,ZonasPagasVigentes!$D:$BA,66,FALSE)","v":{"$error":"#REF!"}},"2018-08-31"]
["ZP",153,{"$f":"INDEX(ZonasPagasVigentes!$B$2:$B$1048576,MATCH(B111,ZonasPagasVigentes!$D$2:$D$1048576,0))","v":"Eliminada"},"optimiza horario de operación desde 01-06-2016","Laboral",{"$f":"VLOOKUP(B111,ZonasPagasVigentes!$D:$BA,66,FALSE)","v":{"$error":"#REF!"}},"2018-08-31"]
["ZP",155,{"$f":"INDEX(ZonasPagasVigentes!$B$2:$B$1048576,MATCH(B112,ZonasPagasVigentes!$D$2:$D$1048576,0))","v":"Eliminada"},"por análisis financiero desde 25-03-2016",null,{"$f":"VLOOKUP(B112,ZonasPagasVigentes!$D:$BA,66,FALSE)","v":{"$error":"#REF!"}},"2016-03-25"]
["ZP",157,{"$f":"INDEX(ZonasPagasVigentes!$B$2:$B$1048576,MATCH(B113,ZonasPagasVigentes!$D$2:$D$1048576,0))","v":"Eliminada"},"por análisis financiero desde 22-02-2016",null,{"$f":"VLOOKUP(B113,ZonasPagasVigentes!$D:$BA,66,FALSE)","v":{"$error":"#REF!"}},"2016-02-22"]
["ZP",159,{"$f":"INDEX(ZonasPagasVigentes!$B$2:$B$1048576,MATCH(B114,ZonasPagasVigentes!$D$2:$D$1048576,0))","v":"Eliminada"},"por análisis financiero desde 25-03-2016",null,{"$f":"VLOOKUP(B114,ZonasPagasVigentes!$D:$BA,66,FALSE)","v":{"$error":"#REF!"}},"2016-03-25"]
["PP",162,{"$f":"INDEX(ZonasPagasVigentes!$B$2:$B$1048576,MATCH(B115,ZonasPagasVigentes!$D$2:$D$1048576,0))","v":"Eliminada"},"desde 01-06-2016 Operada por U2",null,{"$f":"VLOOKUP(B115,ZonasPagasVigentes!$D:$BA,66,FALSE)","v":{"$error":"#REF!"}},"2016-06-01"]
["ZP",164,{"$f":"INDEX(ZonasPagasVigentes!$B$2:$B$1048576,MATCH(B116,ZonasPagasVigentes!$D$2:$D$1048576,0))","v":"Eliminada"},"optimiza horario de operación desde 01-06-2016",null,{"$f":"VLOOKUP(B116,ZonasPagasVigentes!$D:$BA,66,FALSE)","v":{"$error":"#REF!"}}]
["PP",165,{"$f":"INDEX(ZonasPagasVigentes!$B$2:$B$1048576,MATCH(B117,ZonasPagasVigentes!$D$2:$D$1048576,0))","v":"Eliminada"},"desde 01-06-2016 Operada por U2",null,{"$f":"VLOOKUP(B117,ZonasPagasVigentes!$D:$BA,66,FALSE)","v":{"$error":"#REF!"}},"2016-06-01"]
["PP",166,{"$f":"INDEX(ZonasPagasVigentes!$B$2:$B$1048576,MATCH(B118,ZonasPagasVigentes!$D$2:$D$1048576,0))","v":"Activa"},"Agrega C14R PO 12-01-2019",null,{"$f":"VLOOKUP(B118,ZonasPagasVigentes!$D:$BA,66,FALSE)","v":{"$error":"#REF!"}}]
["ZP",168,{"$f":"INDEX(ZonasPagasVigentes!$B$2:$B$1048576,MATCH(B119,ZonasPagasVigentes!$D$2:$D$1048576,0))","v":"Eliminada"},"optimiza horario de operación desde 01-06-2016/ El 7 de Julio se agregan 211cr, 201er,211r,201r",null,{"$f":"VLOOKUP(B119,ZonasPagasVigentes!$D:$BA,66,FALSE)","v":{"$error":"#REF!"}}]
["PP",170,{"$f":"INDEX(ZonasPagasVigentes!$B$2:$B$1048576,MATCH(B120,ZonasPagasVigentes!$D$2:$D$1048576,0))","v":"Eliminada"},"desde 01-06-2016 Operada por U2",null,{"$f":"VLOOKUP(B120,ZonasPagasVigentes!$D:$BA,66,FALSE)","v":{"$error":"#REF!"}},"2016-06-01"]
["ZP",172,{"$f":"INDEX(ZonasPagasVigentes!$B$2:$B$1048576,MATCH(B121,ZonasPagasVigentes!$D$2:$D$1048576,0))","v":"Eliminada"},"Eliminada 05-12-2016 por cambio de Servicio 416e a 546e",null,{"$f":"VLOOKUP(B121,ZonasPagasVigentes!$D:$BA,66,FALSE)","v":{"$error":"#REF!"}},"2016-12-09"]
["ZP",173,{"$f":"INDEX(ZonasPagasVigentes!$B$2:$B$1048576,MATCH(B122,ZonasPagasVigentes!$D$2:$D$1048576,0))","v":"Eliminada"},"Se convierte en una Zona Paga con 172 a partir del 01-06-2016",null,{"$f":"VLOOKUP(B122,ZonasPagasVigentes!$D:$BA,66,FALSE)","v":{"$error":"#REF!"}},"2016-06-01"]
["PP",178,{"$f":"INDEX(ZonasPagasVigentes!$B$2:$B$1048576,MATCH(B123,ZonasPagasVigentes!$D$2:$D$1048576,0))","v":"Activa"},"desde 01-06-2016 Operada por U2",null,{"$f":"VLOOKUP(B123,ZonasPagasVigentes!$D:$BA,66,FALSE)","v":{"$error":"#REF!"}}]
["PP",179,{"$f":"INDEX(ZonasPagasVigentes!$B$2:$B$1048576,MATCH(B124,ZonasPagasVigentes!$D$2:$D$1048576,0))","v":"Eliminada"},"desde 01-06-2016 Operada por U2",null,{"$f":"VLOOKUP(B124,ZonasPagasVigentes!$D:$BA,66,FALSE)","v":{"$error":"#REF!"}},"2016-06-01"]
["ZP",183,{"$f":"INDEX(ZonasPagasVigentes!$B$2:$B$1048576,MATCH(B125,ZonasPagasVigentes!$D$2:$D$1048576,0))","v":"Eliminada"},"optimiza horario de operación desde 01-06-2016",null,{"$f":"VLOOKUP(B125,ZonasPagasVigentes!$D:$BA,66,FALSE)","v":{"$error":"#REF!"}},"2016-07-01"]
["ZP COMPARTIDA",185,{"$f":"INDEX(ZonasPagasVigentes!$B$2:$B$1048576,MATCH(B126,ZonasPagasVigentes!$D$2:$D$1048576,0))","v":"Activa"},"Inicio de operación: 07-01-2010 - optimiza horario de operación desde 01-06-2016",null,{"$f":"VLOOKUP(B126,ZonasPagasVigentes!$D:$BA,66,FALSE)","v":{"$error":"#REF!"}}]
["ZP COMPARTIDA",186,{"$f":"INDEX(ZonasPagasVigentes!$B$2:$B$1048576,MATCH(B127,ZonasPagasVigentes!$D$2:$D$1048576,0))","v":"Activa"},"Inicio de operación: 07-01-2010",null,{"$f":"VLOOKUP(B127,ZonasPagasVigentes!$D:$BA,66,FALSE)","v":{"$error":"#REF!"}}]
["ZP",187,{"$f":"INDEX(ZonasPagasVigentes!$B$2:$B$1048576,MATCH(B128,ZonasPagasVigentes!$D$2:$D$1048576,0))","v":"Activa"},null,null,{"$f":"VLOOKUP(B128,ZonasPagasVigentes!$D:$BA,66,FALSE)","v":{"$error":"#REF!"}}]
["ZP",188,{"$f":"INDEX(ZonasPagasVigentes!$B$2:$B$1048576,MATCH(B129,ZonasPagasVigentes!$D$2:$D$1048576,0))","v":"Activa"},null,null,{"$f":"VLOOKUP(B129,ZonasPagasVigentes!$D:$BA,66,FALSE)","v":{"$error":"#REF!"}}]
["ZP",189,{"$f":"INDEX(ZonasPagasVigentes!$B$2:$B$1048576,MATCH(B130,ZonasPagasVigentes!$D$2:$D$1048576,0))","v":"Eliminada"},"Compartida a partir plan 06,10,12\nVuelve a ZP a partir 27,07,2013\ndesde 01-06-2016 Operada por U5",null,{"$f":"VLOOKUP(B130,ZonasPagasVigentes!$D:$BA,66,FALSE)","v":{"$error":"#REF!"}},"2016-06-01"]
["ZP",190,{"$f":"INDEX(ZonasPagasVigentes!$B$2:$B$1048576,MATCH(B131,ZonasPagasVigentes!$D$2:$D$1048576,0))","v":"Eliminada"},"optimiza horario de operación desde 01-06-2016/ Es eliminada el 31-07-2018 y su horario es absorbido por ZP397",null,{"$f":"VLOOKUP(B131,ZonasPagasVigentes!$D:$BA,66,FALSE)","v":{"$error":"#REF!"}},"2018-07-31"]
["ZP",191,{"$f":"INDEX(ZonasPagasVigentes!$B$2:$B$1048576,MATCH(B132,ZonasPagasVigentes!$D$2:$D$1048576,0))","v":"Eliminada"},"Inicio operación: 05-12-2011",null,{"$f":"VLOOKUP(B132,ZonasPagasVigentes!$D:$BA,66,FALSE)","v":{"$error":"#REF!"}}]
["ZP COMPARTIDA",192,{"$f":"INDEX(ZonasPagasVigentes!$B$2:$B$1048576,MATCH(B133,ZonasPagasVigentes!$D$2:$D$1048576,0))","v":"Eliminada"},"Inicio operación: 05-12-2011\nEl 26-10-2013, se eliminan servicios 229, 301 y 301e, por obras plaza de ciudadanía. Se normaliza 13,03,2014",null,{"$f":"VLOOKUP(B133,ZonasPagasVigentes!$D:$BA,66,FALSE)","v":{"$error":"#REF!"}}]
["ZP COMPARTIDA",193,{"$f":"INDEX(ZonasPagasVigentes!$B$2:$B$1048576,MATCH(B134,ZonasPagasVigentes!$D$2:$D$1048576,0))","v":"Activa"},"Inicio  02-01-2012 -  optimiza horario  desde 01-06-2016 - El 21-02-18 se eliminan 4 servicios de la ZP( 105,109,120 y B09) y se reubican en parada nueva. 05-11-2018 comienza a operar en PTA",null,{"$f":"VLOOKUP(B134,ZonasPagasVigentes!$D:$BA,66,FALSE)","v":{"$error":"#REF!"}}]
["ZP COMPARTIDA",194,{"$f":"INDEX(ZonasPagasVigentes!$B$2:$B$1048576,MATCH(B135,ZonasPagasVigentes!$D$2:$D$1048576,0))","v":"Activa"},"Inicio de operación 02-01-2012/ El 01-12-2017 comienza a operar en PMA también",null,{"$f":"VLOOKUP(B135,ZonasPagasVigentes!$D:$BA,66,FALSE)","v":{"$error":"#REF!"}}]
["ZPF",195,{"$f":"INDEX(ZonasPagasVigentes!$B$2:$B$1048576,MATCH(B136,ZonasPagasVigentes!$D$2:$D$1048576,0))","v":"Eliminada"},"se instalan 2 validadores el 22-12-2011, en la parada EIM BELLAVISTA DE LA FLORIDA.Comparten fisicamente el mismo lugar que ZPF 117\n",null,{"$f":"VLOOKUP(B136,ZonasPagasVigentes!$D:$BA,66,FALSE)","v":{"$error":"#REF!"}},"2017-10-06"]
["N/A",196,{"$f":"INDEX(ZonasPagasVigentes!$B$2:$B$1048576,MATCH(B137,ZonasPagasVigentes!$D$2:$D$1048576,0))","v":"Eliminada"},"Sin TRX",null,{"$f":"VLOOKUP(B137,ZonasPagasVigentes!$D:$BA,66,FALSE)","v":{"$error":"#REF!"}},"2012-03-02"]
["N/A",197,{"$f":"INDEX(ZonasPagasVigentes!$B$2:$B$1048576,MATCH(B138,ZonasPagasVigentes!$D$2:$D$1048576,0))","v":"Eliminada"},"Sin TRX",null,{"$f":"VLOOKUP(B138,ZonasPagasVigentes!$D:$BA,66,FALSE)","v":{"$error":"#REF!"}},"2012-03-02"]
["N/A",198,{"$f":"INDEX(ZonasPagasVigentes!$B$2:$B$1048576,MATCH(B139,ZonasPagasVigentes!$D$2:$D$1048576,0))","v":"Eliminada"},"Sin TRX",null,{"$f":"VLOOKUP(B139,ZonasPagasVigentes!$D:$BA,66,FALSE)","v":{"$error":"#REF!"}},"2012-03-02"]
["ZPM",199,{"$f":"INDEX(ZonasPagasVigentes!$B$2:$B$1048576,MATCH(B140,ZonasPagasVigentes!$D$2:$D$1048576,0))","v":"Activa"},"Inicia operación 27-05-2013 - operada por U7",null,{"$f":"VLOOKUP(B140,ZonasPagasVigentes!$D:$BA,66,FALSE)","v":{"$error":"#REF!"}}]
["ZPM",200,{"$f":"INDEX(ZonasPagasVigentes!$B$2:$B$1048576,MATCH(B141,ZonasPagasVigentes!$D$2:$D$1048576,0))","v":"Activa"},"Inicia operación 27-05-2013 - operada por U7",null,{"$f":"VLOOKUP(B141,ZonasPagasVigentes!$D:$BA,66,FALSE)","v":{"$error":"#REF!"}}]
["ZPM",201,{"$f":"INDEX(ZonasPagasVigentes!$B$2:$B$1048576,MATCH(B142,ZonasPagasVigentes!$D$2:$D$1048576,0))","v":"Activa"},"Inicia operación 27-05-2013 - operada por U7",null,{"$f":"VLOOKUP(B142,ZonasPagasVigentes!$D:$BA,66,FALSE)","v":{"$error":"#REF!"}}]
["ZPM",202,{"$f":"INDEX(ZonasPagasVigentes!$B$2:$B$1048576,MATCH(B143,ZonasPagasVigentes!$D$2:$D$1048576,0))","v":"Activa"},"Inicia operación 17-09-2013 /desde 15-01-2015 -  Operada por U2",null,{"$f":"VLOOKUP(B143,ZonasPagasVigentes!$D:$BA,66,FALSE)","v":{"$error":"#REF!"}}]
["ZPM",203,{"$f":"INDEX(ZonasPagasVigentes!$B$2:$B$1048576,MATCH(B144,ZonasPagasVigentes!$D$2:$D$1048576,0))","v":"Activa"},"Inicia operación 17-09-2013 /desde 15-01-2015 -  Operada por U2",null,{"$f":"VLOOKUP(B144,ZonasPagasVigentes!$D:$BA,66,FALSE)","v":{"$error":"#REF!"}}]
["ZP",204,{"$f":"INDEX(ZonasPagasVigentes!$B$2:$B$1048576,MATCH(B145,ZonasPagasVigentes!$D$2:$D$1048576,0))","v":"Eliminada"},"Sin TRX fue provisoria",null,null,"2014-01-31"]
["ZP",205,{"$f":"INDEX(ZonasPagasVigentes!$B$2:$B$1048576,MATCH(B146,ZonasPagasVigentes!$D$2:$D$1048576,0))","v":"Eliminada"},"Sin TRX fue provisoria",null,{"$f":"VLOOKUP(B146,ZonasPagasVigentes!$D:$BA,66,FALSE)","v":{"$error":"#REF!"}},"2014-02-28"]
["ZP",206,{"$f":"INDEX(ZonasPagasVigentes!$B$2:$B$1048576,MATCH(B147,ZonasPagasVigentes!$D$2:$D$1048576,0))","v":"Eliminada"},"Sin TRX fue provisoria hasta el 09-01-2014",null,null,"2014-01-10"]
["ZP",207,{"$f":"INDEX(ZonasPagasVigentes!$B$2:$B$1048576,MATCH(B148,ZonasPagasVigentes!$D$2:$D$1048576,0))","v":"Eliminada"},"Sin TRX fue provisoria hasta el 09-01-2014",null,{"$f":"VLOOKUP(B148,ZonasPagasVigentes!$D:$BA,66,FALSE)","v":{"$error":"#REF!"}},"2014-01-31"]
["ZPM",208,{"$f":"INDEX(ZonasPagasVigentes!$B$2:$B$1048576,MATCH(B149,ZonasPagasVigentes!$D$2:$D$1048576,0))","v":"Activa"},"Inicia operación 17-02-2014 / desde 15-01-2015 -  Operada por U2",null,{"$f":"VLOOKUP(B149,ZonasPagasVigentes!$D:$BA,66,FALSE)","v":{"$error":"#REF!"}}]
["ZPM",209,{"$f":"INDEX(ZonasPagasVigentes!$B$2:$B$1048576,MATCH(B150,ZonasPagasVigentes!$D$2:$D$1048576,0))","v":"Activa"},"Inicia operación 17-02-2014 / desde 15-01-2015 -  Operada por U2",null,{"$f":"VLOOKUP(B150,ZonasPagasVigentes!$D:$BA,66,FALSE)","v":{"$error":"#REF!"}}]
["PP",210,{"$f":"INDEX(ZonasPagasVigentes!$B$2:$B$1048576,MATCH(B151,ZonasPagasVigentes!$D$2:$D$1048576,0))","v":"Eliminada"},"Sin TRX eliminada el 03-03-2015 - desde 01-06-2016 Operada por U2",null,{"$f":"VLOOKUP(B151,ZonasPagasVigentes!$D:$BA,66,FALSE)","v":{"$error":"#REF!"}},"2015-03-03"]
["ZPM",211,{"$f":"INDEX(ZonasPagasVigentes!$B$2:$B$1048576,MATCH(B152,ZonasPagasVigentes!$D$2:$D$1048576,0))","v":"Activa"},"Inicia operación 17-02-2014 / desde 15-01-2015 -  Operada por U2",null,{"$f":"VLOOKUP(B152,ZonasPagasVigentes!$D:$BA,66,FALSE)","v":{"$error":"#REF!"}}]
["ZPM",212,{"$f":"INDEX(ZonasPagasVigentes!$B$2:$B$1048576,MATCH(B153,ZonasPagasVigentes!$D$2:$D$1048576,0))","v":"Activa"},"Inicia operación 17-02-2014 / desde 15-01-2015 -  Operada por U2",null,{"$f":"VLOOKUP(B153,ZonasPagasVigentes!$D:$BA,66,FALSE)","v":{"$error":"#REF!"}}]
["ZPM",213,{"$f":"INDEX(ZonasPagasVigentes!$B$2:$B$1048576,MATCH(B154,ZonasPagasVigentes!$D$2:$D$1048576,0))","v":"Activa"},"Inicia operación 17-02-2014 / desde 15-01-2015 -  Operada por U2",null,{"$f":"VLOOKUP(B154,ZonasPagasVigentes!$D:$BA,66,FALSE)","v":{"$error":"#REF!"}}]
["VM",214,{"$f":"INDEX(ZonasPagasVigentes!$B$2:$B$1048576,MATCH(B155,ZonasPagasVigentes!$D$2:$D$1048576,0))","v":"Activa"},null,null,{"$f":"VLOOKUP(B155,ZonasPagasVigentes!$D:$BA,66,FALSE)","v":{"$error":"#REF!"}}]
["VM",215,{"$f":"INDEX(ZonasPagasVigentes!$B$2:$B$1048576,MATCH(B156,ZonasPagasVigentes!$D$2:$D$1048576,0))","v":"Activa"},null,null,{"$f":"VLOOKUP(B156,ZonasPagasVigentes!$D:$BA,66,FALSE)","v":{"$error":"#REF!"}}]
["VM",216,{"$f":"INDEX(ZonasPagasVigentes!$B$2:$B$1048576,MATCH(B157,ZonasPagasVigentes!$D$2:$D$1048576,0))","v":"Activa"},null,null,{"$f":"VLOOKUP(B157,ZonasPagasVigentes!$D:$BA,66,FALSE)","v":{"$error":"#REF!"}}]
["VM",217,{"$f":"INDEX(ZonasPagasVigentes!$B$2:$B$1048576,MATCH(B158,ZonasPagasVigentes!$D$2:$D$1048576,0))","v":"Activa"},null,null,{"$f":"VLOOKUP(B158,ZonasPagasVigentes!$D:$BA,66,FALSE)","v":{"$error":"#REF!"}}]
["VM",218,{"$f":"INDEX(ZonasPagasVigentes!$B$2:$B$1048576,MATCH(B159,ZonasPagasVigentes!$D$2:$D$1048576,0))","v":"Activa"},"Agrega 271I PO12-01-2019",null,{"$f":"VLOOKUP(B159,ZonasPagasVigentes!$D:$BA,66,FALSE)","v":{"$error":"#REF!"}}]
["ZPM",219,{"$f":"INDEX(ZonasPagasVigentes!$B$2:$B$1048576,MATCH(B160,ZonasPagasVigentes!$D$2:$D$1048576,0))","v":"Eliminada"},"Se elimina el 04-09-2017 (Se fusionan dos paradas y forman ZP 353)",null,{"$f":"VLOOKUP(B160,ZonasPagasVigentes!$D:$BA,66,FALSE)","v":{"$error":"#REF!"}},"2017-09-14"]
["VM",220,{"$f":"INDEX(ZonasPagasVigentes!$B$2:$B$1048576,MATCH(B161,ZonasPagasVigentes!$D$2:$D$1048576,0))","v":"Activa"},null,null,{"$f":"VLOOKUP(B161,ZonasPagasVigentes!$D:$BA,66,FALSE)","v":{"$error":"#REF!"}}]
["VM",221,{"$f":"INDEX(ZonasPagasVigentes!$B$2:$B$1048576,MATCH(B162,ZonasPagasVigentes!$D$2:$D$1048576,0))","v":"Activa"},null,null,{"$f":"VLOOKUP(B162,ZonasPagasVigentes!$D:$BA,66,FALSE)","v":{"$error":"#REF!"}}]
["VM",222,{"$f":"INDEX(ZonasPagasVigentes!$B$2:$B$1048576,MATCH(B163,ZonasPagasVigentes!$D$2:$D$1048576,0))","v":"Activa"},null,null,{"$f":"VLOOKUP(B163,ZonasPagasVigentes!$D:$BA,66,FALSE)","v":{"$error":"#REF!"}}]
["VM",223,{"$f":"INDEX(ZonasPagasVigentes!$B$2:$B$1048576,MATCH(B164,ZonasPagasVigentes!$D$2:$D$1048576,0))","v":"Activa"},null,null,{"$f":"VLOOKUP(B164,ZonasPagasVigentes!$D:$BA,66,FALSE)","v":{"$error":"#REF!"}}]
["VM",224,{"$f":"INDEX(ZonasPagasVigentes!$B$2:$B$1048576,MATCH(B165,ZonasPagasVigentes!$D$2:$D$1048576,0))","v":"Activa"},null,null,{"$f":"VLOOKUP(B165,ZonasPagasVigentes!$D:$BA,66,FALSE)","v":{"$error":"#REF!"}}]
["VM",225,{"$f":"INDEX(ZonasPagasVigentes!$B$2:$B$1048576,MATCH(B166,ZonasPagasVigentes!$D$2:$D$1048576,0))","v":"Activa"},null,null,{"$f":"VLOOKUP(B166,ZonasPagasVigentes!$D:$BA,66,FALSE)","v":{"$error":"#REF!"}}]
["VM",226,{"$f":"INDEX(ZonasPagasVigentes!$B$2:$B$1048576,MATCH(B167,ZonasPagasVigentes!$D$2:$D$1048576,0))","v":"Activa"},null,null,{"$f":"VLOOKUP(B167,ZonasPagasVigentes!$D:$BA,66,FALSE)","v":{"$error":"#REF!"}}]
["VM",227,{"$f":"INDEX(ZonasPagasVigentes!$B$2:$B$1048576,MATCH(B168,ZonasPagasVigentes!$D$2:$D$1048576,0))","v":"Activa"},null,null,{"$f":"VLOOKUP(B168,ZonasPagasVigentes!$D:$BA,66,FALSE)","v":{"$error":"#REF!"}}]
["VM",228,{"$f":"INDEX(ZonasPagasVigentes!$B$2:$B$1048576,MATCH(B169,ZonasPagasVigentes!$D$2:$D$1048576,0))","v":"Activa"},null,null,{"$f":"VLOOKUP(B169,ZonasPagasVigentes!$D:$BA,66,FALSE)","v":{"$error":"#REF!"}}]
["VM",229,{"$f":"INDEX(ZonasPagasVigentes!$B$2:$B$1048576,MATCH(B170,ZonasPagasVigentes!$D$2:$D$1048576,0))","v":"Activa"},null,null,{"$f":"VLOOKUP(B170,ZonasPagasVigentes!$D:$BA,66,FALSE)","v":{"$error":"#REF!"}}]
["PP",230,{"$f":"INDEX(ZonasPagasVigentes!$B$2:$B$1048576,MATCH(B171,ZonasPagasVigentes!$D$2:$D$1048576,0))","v":"Eliminada"},"Sin TRX eliminada piloto hasta 09-12-2014",null,{"$f":"VLOOKUP(B171,ZonasPagasVigentes!$D:$BA,66,FALSE)","v":{"$error":"#REF!"}},"2014-12-19"]
["VM",231,{"$f":"INDEX(ZonasPagasVigentes!$B$2:$B$1048576,MATCH(B172,ZonasPagasVigentes!$D$2:$D$1048576,0))","v":"Activa"},null,null,{"$f":"VLOOKUP(B172,ZonasPagasVigentes!$D:$BA,66,FALSE)","v":{"$error":"#REF!"}}]
["VM",232,{"$f":"INDEX(ZonasPagasVigentes!$B$2:$B$1048576,MATCH(B173,ZonasPagasVigentes!$D$2:$D$1048576,0))","v":"Activa"},null,null,{"$f":"VLOOKUP(B173,ZonasPagasVigentes!$D:$BA,66,FALSE)","v":{"$error":"#REF!"}}]
["VM",233,{"$f":"INDEX(ZonasPagasVigentes!$B$2:$B$1048576,MATCH(B174,ZonasPagasVigentes!$D$2:$D$1048576,0))","v":"Activa"},null,null,{"$f":"VLOOKUP(B174,ZonasPagasVigentes!$D:$BA,66,FALSE)","v":{"$error":"#REF!"}}]
["VM",234,{"$f":"INDEX(ZonasPagasVigentes!$B$2:$B$1048576,MATCH(B175,ZonasPagasVigentes!$D$2:$D$1048576,0))","v":"Activa"},null,null,{"$f":"VLOOKUP(B175,ZonasPagasVigentes!$D:$BA,66,FALSE)","v":{"$error":"#REF!"}}]
["PP",235,{"$f":"INDEX(ZonasPagasVigentes!$B$2:$B$1048576,MATCH(B176,ZonasPagasVigentes!$D$2:$D$1048576,0))","v":"Eliminada"},"Sin TRX eliminada piloto hasta 09-12-2014",null,{"$f":"VLOOKUP(B176,ZonasPagasVigentes!$D:$BA,66,FALSE)","v":{"$error":"#REF!"}},"2014-12-09"]
["VM",236,{"$f":"INDEX(ZonasPagasVigentes!$B$2:$B$1048576,MATCH(B177,ZonasPagasVigentes!$D$2:$D$1048576,0))","v":"Activa"},null,null,{"$f":"VLOOKUP(B177,ZonasPagasVigentes!$D:$BA,66,FALSE)","v":{"$error":"#REF!"}}]
["VM",237,{"$f":"INDEX(ZonasPagasVigentes!$B$2:$B$1048576,MATCH(B178,ZonasPagasVigentes!$D$2:$D$1048576,0))","v":"Activa"},null,null,{"$f":"VLOOKUP(B178,ZonasPagasVigentes!$D:$BA,66,FALSE)","v":{"$error":"#REF!"}}]
["VM",238,{"$f":"INDEX(ZonasPagasVigentes!$B$2:$B$1048576,MATCH(B179,ZonasPagasVigentes!$D$2:$D$1048576,0))","v":"Activa"},null,null,{"$f":"VLOOKUP(B179,ZonasPagasVigentes!$D:$BA,66,FALSE)","v":{"$error":"#REF!"}}]
["VM",239,{"$f":"INDEX(ZonasPagasVigentes!$B$2:$B$1048576,MATCH(B180,ZonasPagasVigentes!$D$2:$D$1048576,0))","v":"Activa"},"Extiende su horario el 01-08-2018 y absorbe horario de ex ZP239",null,{"$f":"VLOOKUP(B180,ZonasPagasVigentes!$D:$BA,66,FALSE)","v":{"$error":"#REF!"}}]
["VM",240,{"$f":"INDEX(ZonasPagasVigentes!$B$2:$B$1048576,MATCH(B181,ZonasPagasVigentes!$D$2:$D$1048576,0))","v":"Eliminada"},null,null,{"$f":"VLOOKUP(B181,ZonasPagasVigentes!$D:$BA,66,FALSE)","v":{"$error":"#REF!"}}]
["ZPM",241,{"$f":"INDEX(ZonasPagasVigentes!$B$2:$B$1048576,MATCH(B182,ZonasPagasVigentes!$D$2:$D$1048576,0))","v":"Activa"},"desde 01-06-2016 Operada por U2",null,{"$f":"VLOOKUP(B182,ZonasPagasVigentes!$D:$BA,66,FALSE)","v":{"$error":"#REF!"}}]
["ZPM",242,{"$f":"INDEX(ZonasPagasVigentes!$B$2:$B$1048576,MATCH(B183,ZonasPagasVigentes!$D$2:$D$1048576,0))","v":"Activa"},"desde 01-06-2016 Operada por U2",null,{"$f":"VLOOKUP(B183,ZonasPagasVigentes!$D:$BA,66,FALSE)","v":{"$error":"#REF!"}}]
["VM",243,{"$f":"INDEX(ZonasPagasVigentes!$B$2:$B$1048576,MATCH(B184,ZonasPagasVigentes!$D$2:$D$1048576,0))","v":"Activa"},null,null,{"$f":"VLOOKUP(B184,ZonasPagasVigentes!$D:$BA,66,FALSE)","v":{"$error":"#REF!"}}]
["PP",244,{"$f":"INDEX(ZonasPagasVigentes!$B$2:$B$1048576,MATCH(B185,ZonasPagasVigentes!$D$2:$D$1048576,0))","v":"Eliminada"},"Sin TRX eliminada piloto hasta 09-12-2014",null,{"$f":"VLOOKUP(B185,ZonasPagasVigentes!$D:$BA,66,FALSE)","v":{"$error":"#REF!"}},"2014-12-09"]
["VM",245,{"$f":"INDEX(ZonasPagasVigentes!$B$2:$B$1048576,MATCH(B186,ZonasPagasVigentes!$D$2:$D$1048576,0))","v":"Activa"},"inicia 15-01-2015",null,{"$f":"VLOOKUP(B186,ZonasPagasVigentes!$D:$BA,66,FALSE)","v":{"$error":"#REF!"}}]
["VM",246,{"$f":"INDEX(ZonasPagasVigentes!$B$2:$B$1048576,MATCH(B187,ZonasPagasVigentes!$D$2:$D$1048576,0))","v":"Activa"},"inicia 15-01-2015 / Desde martes 29-08-2017 opera entre las 15:00 y 21:00 hrs",null,{"$f":"VLOOKUP(B187,ZonasPagasVigentes!$D:$BA,66,FALSE)","v":{"$error":"#REF!"}}]
["VM",247,{"$f":"INDEX(ZonasPagasVigentes!$B$2:$B$1048576,MATCH(B188,ZonasPagasVigentes!$D$2:$D$1048576,0))","v":"Activa"},"inicia 15-01-2015 / Desde martes 29-08-2017 opera entre las 15:00 y 21:00 hrs",null,{"$f":"VLOOKUP(B188,ZonasPagasVigentes!$D:$BA,66,FALSE)","v":{"$error":"#REF!"}}]
["VM",248,{"$f":"INDEX(ZonasPagasVigentes!$B$2:$B$1048576,MATCH(B189,ZonasPagasVigentes!$D$2:$D$1048576,0))","v":"Activa"},"inicia 15-01-2015 / Desde martes 29-08-2017 opera entre las 15:00 y 21:00 hrs",null,{"$f":"VLOOKUP(B189,ZonasPagasVigentes!$D:$BA,66,FALSE)","v":{"$error":"#REF!"}}]
["VM",249,{"$f":"INDEX(ZonasPagasVigentes!$B$2:$B$1048576,MATCH(B190,ZonasPagasVigentes!$D$2:$D$1048576,0))","v":"Activa"},"inicia 15-01-2015/ El 7 de Julio de 2018 se eliminan 201r, 201er, 211cr, 211r",null,{"$f":"VLOOKUP(B190,ZonasPagasVigentes!$D:$BA,66,FALSE)","v":{"$error":"#REF!"}}]
["VM",250,{"$f":"INDEX(ZonasPagasVigentes!$B$2:$B$1048576,MATCH(B191,ZonasPagasVigentes!$D$2:$D$1048576,0))","v":"Activa"},"inicia 15-01-2015/ El 7 de Julio de 2018 se eliminan 201r, 211cr, 211r",null,{"$f":"VLOOKUP(B191,ZonasPagasVigentes!$D:$BA,66,FALSE)","v":{"$error":"#REF!"}}]
["VM",251,{"$f":"INDEX(ZonasPagasVigentes!$B$2:$B$1048576,MATCH(B192,ZonasPagasVigentes!$D$2:$D$1048576,0))","v":"Eliminada"},"inicia 15-01-2015/ El 7 de Julio de 2018 se incorpor el servicio G14I",null,{"$f":"VLOOKUP(B192,ZonasPagasVigentes!$D:$BA,66,FALSE)","v":{"$error":"#REF!"}}]
["VM",252,{"$f":"INDEX(ZonasPagasVigentes!$B$2:$B$1048576,MATCH(B193,ZonasPagasVigentes!$D$2:$D$1048576,0))","v":"Eliminada"},null,null,{"$f":"VLOOKUP(B193,ZonasPagasVigentes!$D:$BA,66,FALSE)","v":{"$error":"#REF!"}}]
["VM",253,{"$f":"INDEX(ZonasPagasVigentes!$B$2:$B$1048576,MATCH(B194,ZonasPagasVigentes!$D$2:$D$1048576,0))","v":"Eliminada"},null,null,{"$f":"VLOOKUP(B194,ZonasPagasVigentes!$D:$BA,66,FALSE)","v":{"$error":"#REF!"}}]
["VM",255,{"$f":"INDEX(ZonasPagasVigentes!$B$2:$B$1048576,MATCH(B195,ZonasPagasVigentes!$D$2:$D$1048576,0))","v":"Activa"},"Eliminada 01-04-2016 / Reabrió  22-05-2017",null,{"$f":"VLOOKUP(B195,ZonasPagasVigentes!$D:$BA,66,FALSE)","v":{"$error":"#REF!"}}]
["VM",256,{"$f":"INDEX(ZonasPagasVigentes!$B$2:$B$1048576,MATCH(B196,ZonasPagasVigentes!$D$2:$D$1048576,0))","v":"Eliminada"},"Eliminada 01-04-2016 / Reabrió  22-05-2017/ Baja operación 13-07-2018 y es absorbido por Z.P 98","Laboral",{"$f":"VLOOKUP(B196,ZonasPagasVigentes!$D:$BA,66,FALSE)","v":{"$error":"#REF!"}},"2018-07-13"]
["VM",257,{"$f":"INDEX(ZonasPagasVigentes!$B$2:$B$1048576,MATCH(B197,ZonasPagasVigentes!$D$2:$D$1048576,0))","v":"Activa"},"24-06-2018 modifica horario de domingo (pasa de 12:00-20:00 a 11:00-19:00) ",null,{"$f":"VLOOKUP(B197,ZonasPagasVigentes!$D:$BA,66,FALSE)","v":{"$error":"#REF!"}}]
["VM",258,{"$f":"INDEX(ZonasPagasVigentes!$B$2:$B$1048576,MATCH(B198,ZonasPagasVigentes!$D$2:$D$1048576,0))","v":"Eliminada"},"Inicia 07-03-2016 / Eliminada 05-07-2017",null,{"$f":"VLOOKUP(B198,ZonasPagasVigentes!$D:$BA,66,FALSE)","v":{"$error":"#REF!"}},"2017-07-05"]
["VM",259,{"$f":"INDEX(ZonasPagasVigentes!$B$2:$B$1048576,MATCH(B199,ZonasPagasVigentes!$D$2:$D$1048576,0))","v":"Eliminada"},"Comienza en PMA el 11-10-2016",null,{"$f":"VLOOKUP(B199,ZonasPagasVigentes!$D:$BA,66,FALSE)","v":{"$error":"#REF!"}}]
["VM",260,{"$f":"INDEX(ZonasPagasVigentes!$B$2:$B$1048576,MATCH(B200,ZonasPagasVigentes!$D$2:$D$1048576,0))","v":"Eliminada"},"Comienza en PMA el 11-10-2016/ se supende operación el miércoles 14 de febrero debido a trabajos viales en eje compañía, vuelve a operar 03-03-18",null,{"$f":"VLOOKUP(B200,ZonasPagasVigentes!$D:$BA,66,FALSE)","v":{"$error":"#REF!"}}]
["VM",261,{"$f":"INDEX(ZonasPagasVigentes!$B$2:$B$1048576,MATCH(B201,ZonasPagasVigentes!$D$2:$D$1048576,0))","v":"Eliminada"},"Comienza en PMA el 11-10-2016",null,{"$f":"VLOOKUP(B201,ZonasPagasVigentes!$D:$BA,66,FALSE)","v":{"$error":"#REF!"}}]
["VM",262,{"$f":"INDEX(ZonasPagasVigentes!$B$2:$B$1048576,MATCH(B202,ZonasPagasVigentes!$D$2:$D$1048576,0))","v":"Activa"},null,null,{"$f":"VLOOKUP(B202,ZonasPagasVigentes!$D:$BA,66,FALSE)","v":{"$error":"#REF!"}}]
["VM",263,{"$f":"INDEX(ZonasPagasVigentes!$B$2:$B$1048576,MATCH(B203,ZonasPagasVigentes!$D$2:$D$1048576,0))","v":"Activa"},null,null,{"$f":"VLOOKUP(B203,ZonasPagasVigentes!$D:$BA,66,FALSE)","v":{"$error":"#REF!"}}]
["VM",264,{"$f":"INDEX(ZonasPagasVigentes!$B$2:$B$1048576,MATCH(B204,ZonasPagasVigentes!$D$2:$D$1048576,0))","v":"Activa"},null,null,{"$f":"VLOOKUP(B204,ZonasPagasVigentes!$D:$BA,66,FALSE)","v":{"$error":"#REF!"}}]
["ZPM",265,{"$f":"INDEX(ZonasPagasVigentes!$B$2:$B$1048576,MATCH(B205,ZonasPagasVigentes!$D$2:$D$1048576,0))","v":"Activa"},"Elimación 201eI en PO 12-01-2019",null,{"$f":"VLOOKUP(B205,ZonasPagasVigentes!$D:$BA,66,FALSE)","v":{"$error":"#REF!"}}]
["ZPM",266,{"$f":"INDEX(ZonasPagasVigentes!$B$2:$B$1048576,MATCH(B206,ZonasPagasVigentes!$D$2:$D$1048576,0))","v":"Activa"},null,null,{"$f":"VLOOKUP(B206,ZonasPagasVigentes!$D:$BA,66,FALSE)","v":{"$error":"#REF!"}}]
["ZPM",267,{"$f":"INDEX(ZonasPagasVigentes!$B$2:$B$1048576,MATCH(B207,ZonasPagasVigentes!$D$2:$D$1048576,0))","v":"Activa"},null,null,{"$f":"VLOOKUP(B207,ZonasPagasVigentes!$D:$BA,66,FALSE)","v":{"$error":"#REF!"}}]
["ZPM",268,{"$f":"INDEX(ZonasPagasVigentes!$B$2:$B$1048576,MATCH(B208,ZonasPagasVigentes!$D$2:$D$1048576,0))","v":"Activa"},"En el PO de Julio de 2017, se eliminó el servicio 218e",null,{"$f":"VLOOKUP(B208,ZonasPagasVigentes!$D:$BA,66,FALSE)","v":{"$error":"#REF!"}}]
["ZPM",269,{"$f":"INDEX(ZonasPagasVigentes!$B$2:$B$1048576,MATCH(B209,ZonasPagasVigentes!$D$2:$D$1048576,0))","v":"Activa"},null,null,{"$f":"VLOOKUP(B209,ZonasPagasVigentes!$D:$BA,66,FALSE)","v":{"$error":"#REF!"}}]
["ZPM",270,{"$f":"INDEX(ZonasPagasVigentes!$B$2:$B$1048576,MATCH(B210,ZonasPagasVigentes!$D$2:$D$1048576,0))","v":"Suspendida "},null,null,{"$f":"VLOOKUP(B210,ZonasPagasVigentes!$D:$BA,66,FALSE)","v":{"$error":"#REF!"}}]
["ZPM",271,{"$f":"INDEX(ZonasPagasVigentes!$B$2:$B$1048576,MATCH(B211,ZonasPagasVigentes!$D$2:$D$1048576,0))","v":"Suspendida "},"inicia 27-06-2016, comienza en PMA el 17-10-2016",null,{"$f":"VLOOKUP(B211,ZonasPagasVigentes!$D:$BA,66,FALSE)","v":{"$error":"#REF!"}}]
["ZPM",272,{"$f":"INDEX(ZonasPagasVigentes!$B$2:$B$1048576,MATCH(B212,ZonasPagasVigentes!$D$2:$D$1048576,0))","v":"Activa"},"inicia 27-06-2016",null,{"$f":"VLOOKUP(B212,ZonasPagasVigentes!$D:$BA,66,FALSE)","v":{"$error":"#REF!"}}]
["ZPM",273,{"$f":"INDEX(ZonasPagasVigentes!$B$2:$B$1048576,MATCH(B213,ZonasPagasVigentes!$D$2:$D$1048576,0))","v":"Activa"},"inicia 27-06-2016, comienza en PMA el 17-10-2016",null,{"$f":"VLOOKUP(B213,ZonasPagasVigentes!$D:$BA,66,FALSE)","v":{"$error":"#REF!"}}]
["ZPM",274,{"$f":"INDEX(ZonasPagasVigentes!$B$2:$B$1048576,MATCH(B214,ZonasPagasVigentes!$D$2:$D$1048576,0))","v":"Activa"},"inicia 27-06-2016, comienza en PMA el 28-11-2016/ Modifica su horario domingo el 24-06-2018 (pasa de 12:00-20:00 a 11:00-19:00)",null,{"$f":"VLOOKUP(B214,ZonasPagasVigentes!$D:$BA,66,FALSE)","v":{"$error":"#REF!"}}]
["ZPM",275,{"$f":"INDEX(ZonasPagasVigentes!$B$2:$B$1048576,MATCH(B215,ZonasPagasVigentes!$D$2:$D$1048576,0))","v":{"$error":"#N/A"}},"inicia 27-06-2016, comienza en PMA el 28-11-2016/ Modifica su horario domingo el 24-06-2018 (pasa de 12:00-20:00 a 11:00-19:00)",null,{"$f":"VLOOKUP(B215,ZonasPagasVigentes!$D:$BA,66,FALSE)","v":{"$error":"#N/A"}}]
["ZPM",276,{"$f":"INDEX(ZonasPagasVigentes!$B$2:$B$1048576,MATCH(B216,ZonasPagasVigentes!$D$2:$D$1048576,0))","v":"Eliminada"},"ex 58 reinicia el 08-07-2016",null,{"$f":"VLOOKUP(B216,ZonasPagasVigentes!$D:$BA,66,FALSE)","v":{"$error":"#REF!"}}]
["ZPM",277,{"$f":"INDEX(ZonasPagasVigentes!$B$2:$B$1048576,MATCH(B217,ZonasPagasVigentes!$D$2:$D$1048576,0))","v":"Suspendida "},"ex 115 reinicia el 08-07-2016",null,{"$f":"VLOOKUP(B217,ZonasPagasVigentes!$D:$BA,66,FALSE)","v":{"$error":"#REF!"}}]
["ZPM",278,{"$f":"INDEX(ZonasPagasVigentes!$B$2:$B$1048576,MATCH(B218,ZonasPagasVigentes!$D$2:$D$1048576,0))","v":"Eliminada"},"ex 173 reinicia el 08-07-2016","Laboral",{"$f":"VLOOKUP(B218,ZonasPagasVigentes!$D:$BA,66,FALSE)","v":{"$error":"#REF!"}},"2018-08-31"]
["ZPM",279,{"$f":"INDEX(ZonasPagasVigentes!$B$2:$B$1048576,MATCH(B219,ZonasPagasVigentes!$D$2:$D$1048576,0))","v":"Activa"},"ex 43 reinicia el 08-07-2016/ El día 12-07-2018 pasa de operar con 4 validadores a operar con 3;Agrega J19I, J19R PO 12-01.2019",null,{"$f":"VLOOKUP(B219,ZonasPagasVigentes!$D:$BA,66,FALSE)","v":{"$error":"#REF!"}}]
["ZPM",280,{"$f":"INDEX(ZonasPagasVigentes!$B$2:$B$1048576,MATCH(B220,ZonasPagasVigentes!$D$2:$D$1048576,0))","v":"Eliminada"},"ex 64 reinicia el 08-07-2016",null,{"$f":"VLOOKUP(B220,ZonasPagasVigentes!$D:$BA,66,FALSE)","v":{"$error":"#REF!"}}]
["ZPM",281,{"$f":"INDEX(ZonasPagasVigentes!$B$2:$B$1048576,MATCH(B221,ZonasPagasVigentes!$D$2:$D$1048576,0))","v":"Eliminada"},"ex 97 reinicia el 08-07-2016/ El día 12-07-2018 pasa de operar con 3 validadores a operar con 2",null,{"$f":"VLOOKUP(B221,ZonasPagasVigentes!$D:$BA,66,FALSE)","v":{"$error":"#REF!"}}]
["ZPM",282,{"$f":"INDEX(ZonasPagasVigentes!$B$2:$B$1048576,MATCH(B222,ZonasPagasVigentes!$D$2:$D$1048576,0))","v":"Eliminada"},"inicia 29-08-2016",null,{"$f":"VLOOKUP(B222,ZonasPagasVigentes!$D:$BA,66,FALSE)","v":{"$error":"#REF!"}}]
["ZPM",283,{"$f":"INDEX(ZonasPagasVigentes!$B$2:$B$1048576,MATCH(B223,ZonasPagasVigentes!$D$2:$D$1048576,0))","v":"Activa"},"inicia 29-08-2016",null,{"$f":"VLOOKUP(B223,ZonasPagasVigentes!$D:$BA,66,FALSE)","v":{"$error":"#REF!"}}]
["ZPM",284,{"$f":"INDEX(ZonasPagasVigentes!$B$2:$B$1048576,MATCH(B224,ZonasPagasVigentes!$D$2:$D$1048576,0))","v":"Activa"},"inicia 30-09-2016",null,{"$f":"VLOOKUP(B224,ZonasPagasVigentes!$D:$BA,66,FALSE)","v":{"$error":"#REF!"}}]
["ZPM",285,{"$f":"INDEX(ZonasPagasVigentes!$B$2:$B$1048576,MATCH(B225,ZonasPagasVigentes!$D$2:$D$1048576,0))","v":"Activa"},"inicia 30-09-2016",null,{"$f":"VLOOKUP(B225,ZonasPagasVigentes!$D:$BA,66,FALSE)","v":{"$error":"#REF!"}}]
["ZPM",286,{"$f":"INDEX(ZonasPagasVigentes!$B$2:$B$1048576,MATCH(B226,ZonasPagasVigentes!$D$2:$D$1048576,0))","v":"Activa"},"inicia 17-10-2016",null,{"$f":"VLOOKUP(B226,ZonasPagasVigentes!$D:$BA,66,FALSE)","v":{"$error":"#REF!"}}]
["ZPM",287,{"$f":"INDEX(ZonasPagasVigentes!$B$2:$B$1048576,MATCH(B227,ZonasPagasVigentes!$D$2:$D$1048576,0))","v":"Activa"},"inicia 02-12-2016 / El día 10 de Septiembre se incorporan 2 validadores, para 2 servicios",null,{"$f":"VLOOKUP(B227,ZonasPagasVigentes!$D:$BA,66,FALSE)","v":{"$error":"#REF!"}}]
["ZPM",288,{"$f":"INDEX(ZonasPagasVigentes!$B$2:$B$1048576,MATCH(B228,ZonasPagasVigentes!$D$2:$D$1048576,0))","v":"Suspendida "},"inicia 19-10-2016, ex ZP 69",null,{"$f":"VLOOKUP(B228,ZonasPagasVigentes!$D:$BA,66,FALSE)","v":{"$error":"#REF!"}}]
["ZPM",289,{"$f":"INDEX(ZonasPagasVigentes!$B$2:$B$1048576,MATCH(B229,ZonasPagasVigentes!$D$2:$D$1048576,0))","v":"Eliminada"},"inicia 24-10-2016/ El 01-12-2017 se suspende momentáneamente su operación y se traspasa a TATA","Laboral",{"$f":"VLOOKUP(B229,ZonasPagasVigentes!$D:$BA,66,FALSE)","v":{"$error":"#REF!"}},"2018-08-31"]
["ZPM",290,{"$f":"INDEX(ZonasPagasVigentes!$B$2:$B$1048576,MATCH(B230,ZonasPagasVigentes!$D$2:$D$1048576,0))","v":"Activa"},"inicia 24-10-2016",null,{"$f":"VLOOKUP(B230,ZonasPagasVigentes!$D:$BA,66,FALSE)","v":{"$error":"#REF!"}}]
["ZPM",291,{"$f":"INDEX(ZonasPagasVigentes!$B$2:$B$1048576,MATCH(B231,ZonasPagasVigentes!$D$2:$D$1048576,0))","v":"Activa"},"inicia 14-11-2016 termina 09-12-2016 - inicia 05-01-2017 - El 14-06-2018 extiende horario laboral (Pasa de 14:00 - 22:00 a 6:30 a 22:00)",null,{"$f":"VLOOKUP(B231,ZonasPagasVigentes!$D:$BA,66,FALSE)","v":{"$error":"#REF!"}},null,null,null,"2018-07-22"]
["ZPM",292,{"$f":"INDEX(ZonasPagasVigentes!$B$2:$B$1048576,MATCH(B232,ZonasPagasVigentes!$D$2:$D$1048576,0))","v":"Suspendida "},"inicia 24-11-2016",null,{"$f":"VLOOKUP(B232,ZonasPagasVigentes!$D:$BA,66,FALSE)","v":{"$error":"#REF!"}}]
["ZPM",293,{"$f":"INDEX(ZonasPagasVigentes!$B$2:$B$1048576,MATCH(B233,ZonasPagasVigentes!$D$2:$D$1048576,0))","v":"Eliminada"},"inicia 24-11-2016",null,{"$f":"VLOOKUP(B233,ZonasPagasVigentes!$D:$BA,66,FALSE)","v":{"$error":"#REF!"}}]
["ZPM",294,{"$f":"INDEX(ZonasPagasVigentes!$B$2:$B$1048576,MATCH(B234,ZonasPagasVigentes!$D$2:$D$1048576,0))","v":"Suspendida "},"inicia 23-11-2016",null,{"$f":"VLOOKUP(B234,ZonasPagasVigentes!$D:$BA,66,FALSE)","v":{"$error":"#REF!"}}]
["ZPM",295,{"$f":"INDEX(ZonasPagasVigentes!$B$2:$B$1048576,MATCH(B235,ZonasPagasVigentes!$D$2:$D$1048576,0))","v":"Suspendida "},"inicia 23-11-2016",null,{"$f":"VLOOKUP(B235,ZonasPagasVigentes!$D:$BA,66,FALSE)","v":{"$error":"#REF!"}}]
["ZPM",296,{"$f":"INDEX(ZonasPagasVigentes!$B$2:$B$1048576,MATCH(B236,ZonasPagasVigentes!$D$2:$D$1048576,0))","v":"Activa"},"inicia 23-11-2016","L-S-D",{"$f":"VLOOKUP(B236,ZonasPagasVigentes!$D:$BA,66,FALSE)","v":{"$error":"#REF!"}},null,"2018-08-04",null,"05-08-208"]
["ZPM",297,{"$f":"INDEX(ZonasPagasVigentes!$B$2:$B$1048576,MATCH(B237,ZonasPagasVigentes!$D$2:$D$1048576,0))","v":"Activa"},"inicia 07-12-2016",null,{"$f":"VLOOKUP(B237,ZonasPagasVigentes!$D:$BA,66,FALSE)","v":{"$error":"#REF!"}}]
["ZPM",298,{"$f":"INDEX(ZonasPagasVigentes!$B$2:$B$1048576,MATCH(B238,ZonasPagasVigentes!$D$2:$D$1048576,0))","v":"Activa"},"inicia 09-11-2016",null,{"$f":"VLOOKUP(B238,ZonasPagasVigentes!$D:$BA,66,FALSE)","v":{"$error":"#REF!"}}]
["ZPM",299,{"$f":"INDEX(ZonasPagasVigentes!$B$2:$B$1048576,MATCH(B239,ZonasPagasVigentes!$D$2:$D$1048576,0))","v":"Eliminada"},"inicia 05-12-2016","Laboral",{"$f":"VLOOKUP(B239,ZonasPagasVigentes!$D:$BA,66,FALSE)","v":{"$error":"#REF!"}},"2018-08-31"]
["ZPM",300,{"$f":"INDEX(ZonasPagasVigentes!$B$2:$B$1048576,MATCH(B240,ZonasPagasVigentes!$D$2:$D$1048576,0))","v":"Suspendida "},"inicia 30-01-2017 / Servicio H12 no opera en la parada debido a trabajos viales EIM Franklin; Agrega 271I PO 12-01-2019",null,{"$f":"VLOOKUP(B240,ZonasPagasVigentes!$D:$BA,66,FALSE)","v":{"$error":"#REF!"}}]
["ZPM",301,{"$f":"INDEX(ZonasPagasVigentes!$B$2:$B$1048576,MATCH(B241,ZonasPagasVigentes!$D$2:$D$1048576,0))","v":"Eliminada"},"inicia 17-01-2017 termina 24-02-2017",null,{"$f":"VLOOKUP(B241,ZonasPagasVigentes!$D:$BA,66,FALSE)","v":{"$error":"#REF!"}},"2017-02-24"]
["ZPM",302,{"$f":"INDEX(ZonasPagasVigentes!$B$2:$B$1048576,MATCH(B242,ZonasPagasVigentes!$D$2:$D$1048576,0))","v":"Eliminada"},"inicia 17-01-2017 termina 24-02-2017",null,{"$f":"VLOOKUP(B242,ZonasPagasVigentes!$D:$BA,66,FALSE)","v":{"$error":"#REF!"}},"2017-02-24"]
["ZPM",303,{"$f":"INDEX(ZonasPagasVigentes!$B$2:$B$1048576,MATCH(B243,ZonasPagasVigentes!$D$2:$D$1048576,0))","v":"Activa"},"inicia 20-02-2017",null,{"$f":"VLOOKUP(B243,ZonasPagasVigentes!$D:$BA,66,FALSE)","v":{"$error":"#REF!"}}]
["ZPM",304,{"$f":"INDEX(ZonasPagasVigentes!$B$2:$B$1048576,MATCH(B244,ZonasPagasVigentes!$D$2:$D$1048576,0))","v":"Activa"},"inicia 20-02-2017",null,{"$f":"VLOOKUP(B244,ZonasPagasVigentes!$D:$BA,66,FALSE)","v":{"$error":"#REF!"}}]
["ZPM",305,{"$f":"INDEX(ZonasPagasVigentes!$B$2:$B$1048576,MATCH(B245,ZonasPagasVigentes!$D$2:$D$1048576,0))","v":"Activa"},"inicia 20-02-2017",null,{"$f":"VLOOKUP(B245,ZonasPagasVigentes!$D:$BA,66,FALSE)","v":{"$error":"#REF!"}}]
["ZPM",306,{"$f":"INDEX(ZonasPagasVigentes!$B$2:$B$1048576,MATCH(B246,ZonasPagasVigentes!$D$2:$D$1048576,0))","v":"Activa"},"inicia 20-02-2017 / 19-03-2018 extiende su horario 1 hora (dinaliza a las 10 y se extiende a las 11); Agrega 271R PO 12-01-2019",null,{"$f":"VLOOKUP(B246,ZonasPagasVigentes!$D:$BA,66,FALSE)","v":{"$error":"#REF!"}}]
["ZPM",308,{"$f":"INDEX(ZonasPagasVigentes!$B$2:$B$1048576,MATCH(B247,ZonasPagasVigentes!$D$2:$D$1048576,0))","v":"Eliminada"},"inicia 01-03-2017","Laboral",{"$f":"VLOOKUP(B247,ZonasPagasVigentes!$D:$BA,66,FALSE)","v":{"$error":"#REF!"}},"2018-07-13"]
["ZPM",309,{"$f":"INDEX(ZonasPagasVigentes!$B$2:$B$1048576,MATCH(B248,ZonasPagasVigentes!$D$2:$D$1048576,0))","v":"Eliminada"},"inicia 01-03-2017","Laboral",{"$f":"VLOOKUP(B248,ZonasPagasVigentes!$D:$BA,66,FALSE)","v":{"$error":"#REF!"}},"2018-07-13"]
["ZPM",310,{"$f":"INDEX(ZonasPagasVigentes!$B$2:$B$1048576,MATCH(B249,ZonasPagasVigentes!$D$2:$D$1048576,0))","v":"Suspendida "},"inicia 20-03-2017; Elimina 314eR y Agrega B12cI PO 12-01-2019",null,{"$f":"VLOOKUP(B249,ZonasPagasVigentes!$D:$BA,66,FALSE)","v":{"$error":"#REF!"}}]
["ZPM",311,{"$f":"INDEX(ZonasPagasVigentes!$B$2:$B$1048576,MATCH(B250,ZonasPagasVigentes!$D$2:$D$1048576,0))","v":"Suspendida "},"inicia 20-03-2017; Elimina B13, agrega 308cI, 307cI Y 315cI po 12-01.2019",null,{"$f":"VLOOKUP(B250,ZonasPagasVigentes!$D:$BA,66,FALSE)","v":{"$error":"#REF!"}}]
["ZPM",312,{"$f":"INDEX(ZonasPagasVigentes!$B$2:$B$1048576,MATCH(B251,ZonasPagasVigentes!$D$2:$D$1048576,0))","v":"Eliminada"},"inicia 20-03-2017 termina 08-05-2017",null,{"$f":"VLOOKUP(B251,ZonasPagasVigentes!$D:$BA,66,FALSE)","v":{"$error":"#REF!"}},"2017-05-05"]
["ZPM",313,{"$f":"INDEX(ZonasPagasVigentes!$B$2:$B$1048576,MATCH(B252,ZonasPagasVigentes!$D$2:$D$1048576,0))","v":"Suspendida "},"inicia 20-03-2017; Elimina 312eI, 316eI y 314eI, Agrega B12cI  PO 12-01-2019",null,{"$f":"VLOOKUP(B252,ZonasPagasVigentes!$D:$BA,66,FALSE)","v":{"$error":"#REF!"}}]
["ZPM",314,{"$f":"INDEX(ZonasPagasVigentes!$B$2:$B$1048576,MATCH(B253,ZonasPagasVigentes!$D$2:$D$1048576,0))","v":"Suspendida "},"inicia 20-03-2017; Elimina 312eI y 314eI, Agrega 308cI 12-01.2019",null,{"$f":"VLOOKUP(B253,ZonasPagasVigentes!$D:$BA,66,FALSE)","v":{"$error":"#REF!"}}]
["ZPM",315,{"$f":"INDEX(ZonasPagasVigentes!$B$2:$B$1048576,MATCH(B254,ZonasPagasVigentes!$D$2:$D$1048576,0))","v":"Eliminada"},"inicia 20-03-2017 termina 08-05-2017",null,{"$f":"VLOOKUP(B254,ZonasPagasVigentes!$D:$BA,66,FALSE)","v":{"$error":"#REF!"}},"2017-05-05"]
["ZPM",316,{"$f":"INDEX(ZonasPagasVigentes!$B$2:$B$1048576,MATCH(B255,ZonasPagasVigentes!$D$2:$D$1048576,0))","v":"Suspendida "},"inicia 20-03-2017 / Se baja un validador y se reutiliza para ZP360; Elimina B06R y agrega 307cI, 315cI PO 12-01-2019",null,{"$f":"VLOOKUP(B255,ZonasPagasVigentes!$D:$BA,66,FALSE)","v":{"$error":"#REF!"}}]
["ZPM",317,{"$f":"INDEX(ZonasPagasVigentes!$B$2:$B$1048576,MATCH(B256,ZonasPagasVigentes!$D$2:$D$1048576,0))","v":"Eliminada"},"inicia 24-04-2017/ El 9 de julio se incorpora servicio I25",null,{"$f":"VLOOKUP(B256,ZonasPagasVigentes!$D:$BA,66,FALSE)","v":{"$error":"#REF!"}}]
["ZPM",318,{"$f":"INDEX(ZonasPagasVigentes!$B$2:$B$1048576,MATCH(B257,ZonasPagasVigentes!$D$2:$D$1048576,0))","v":"Eliminada"},"inicia 24-04-2017; Elimina 407I PO 12-01-2019",null,{"$f":"VLOOKUP(B257,ZonasPagasVigentes!$D:$BA,66,FALSE)","v":{"$error":"#REF!"}}]
["ZPM",319,{"$f":"INDEX(ZonasPagasVigentes!$B$2:$B$1048576,MATCH(B258,ZonasPagasVigentes!$D$2:$D$1048576,0))","v":"Activa"},"inicia 24-04-2017",null,{"$f":"VLOOKUP(B258,ZonasPagasVigentes!$D:$BA,66,FALSE)","v":{"$error":"#REF!"}}]
["ZPM",320,{"$f":"INDEX(ZonasPagasVigentes!$B$2:$B$1048576,MATCH(B259,ZonasPagasVigentes!$D$2:$D$1048576,0))","v":"Eliminada"},"inicia 24-04-2017",null,{"$f":"VLOOKUP(B259,ZonasPagasVigentes!$D:$BA,66,FALSE)","v":{"$error":"#REF!"}}]
["ZPM",321,{"$f":"INDEX(ZonasPagasVigentes!$B$2:$B$1048576,MATCH(B260,ZonasPagasVigentes!$D$2:$D$1048576,0))","v":"Eliminada"},"inicia 17-04-2017",null,{"$f":"VLOOKUP(B260,ZonasPagasVigentes!$D:$BA,66,FALSE)","v":{"$error":"#REF!"}}]
["ZPM",322,{"$f":"INDEX(ZonasPagasVigentes!$B$2:$B$1048576,MATCH(B261,ZonasPagasVigentes!$D$2:$D$1048576,0))","v":"Activa"},"inicia 17-04-2017; Elimina 307eI, 314eR PO 12-01-2019",null,{"$f":"VLOOKUP(B261,ZonasPagasVigentes!$D:$BA,66,FALSE)","v":{"$error":"#REF!"}}]
["ZPM",323,{"$f":"INDEX(ZonasPagasVigentes!$B$2:$B$1048576,MATCH(B262,ZonasPagasVigentes!$D$2:$D$1048576,0))","v":"Activa"},"inicia 17-04-2017; Elimina 314eR PO 12-01-2019",null,{"$f":"VLOOKUP(B262,ZonasPagasVigentes!$D:$BA,66,FALSE)","v":{"$error":"#REF!"}}]
["ZPM",324,{"$f":"INDEX(ZonasPagasVigentes!$B$2:$B$1048576,MATCH(B263,ZonasPagasVigentes!$D$2:$D$1048576,0))","v":"Eliminada"},"inicia 17-04-2017; Elimina 314eR PO 12-01-2019",null,{"$f":"VLOOKUP(B263,ZonasPagasVigentes!$D:$BA,66,FALSE)","v":{"$error":"#REF!"}}]
["ZPM",325,{"$f":"INDEX(ZonasPagasVigentes!$B$2:$B$1048576,MATCH(B264,ZonasPagasVigentes!$D$2:$D$1048576,0))","v":"Activa"},"inicia 17-04-2017 / El 01-03-2018 atrasa su fin en una hora (desde las 21:00 a las 22:00) / El 20-03-2018 comienza a operar desde las 6:00 hasta las 21:00; Elimina 312eR, 314eR, 316eR PO 12-01.2018",null,{"$f":"VLOOKUP(B264,ZonasPagasVigentes!$D:$BA,66,FALSE)","v":{"$error":"#REF!"}}]
["ZPM",326,{"$f":"INDEX(ZonasPagasVigentes!$B$2:$B$1048576,MATCH(B265,ZonasPagasVigentes!$D$2:$D$1048576,0))","v":"Eliminada"},"inicia 26-04-2017 / Finalizó 05-07-2017 (cambió codigo a 341)",null,{"$f":"VLOOKUP(B265,ZonasPagasVigentes!$D:$BA,66,FALSE)","v":{"$error":"#REF!"}},"2017-07-05"]
["ZPM",327,{"$f":"INDEX(ZonasPagasVigentes!$B$2:$B$1048576,MATCH(B266,ZonasPagasVigentes!$D$2:$D$1048576,0))","v":"Eliminada"},"inicia 26-04-2017",null,{"$f":"VLOOKUP(B266,ZonasPagasVigentes!$D:$BA,66,FALSE)","v":{"$error":"#REF!"}}]
["ZPM",328,{"$f":"INDEX(ZonasPagasVigentes!$B$2:$B$1048576,MATCH(B267,ZonasPagasVigentes!$D$2:$D$1048576,0))","v":"Eliminada"},"inicia 02-05-2017",null,{"$f":"VLOOKUP(B267,ZonasPagasVigentes!$D:$BA,66,FALSE)","v":{"$error":"#REF!"}}]
["ZPM",329,{"$f":"INDEX(ZonasPagasVigentes!$B$2:$B$1048576,MATCH(B268,ZonasPagasVigentes!$D$2:$D$1048576,0))","v":"Activa"},"inicia 02-05-2017",null,{"$f":"VLOOKUP(B268,ZonasPagasVigentes!$D:$BA,66,FALSE)","v":{"$error":"#REF!"}}]
["ZPM",330,{"$f":"INDEX(ZonasPagasVigentes!$B$2:$B$1048576,MATCH(B269,ZonasPagasVigentes!$D$2:$D$1048576,0))","v":"Eliminada"},"inicia 02-05-2017",null,{"$f":"VLOOKUP(B269,ZonasPagasVigentes!$D:$BA,66,FALSE)","v":{"$error":"#REF!"}}]
["ZPM",331,{"$f":"INDEX(ZonasPagasVigentes!$B$2:$B$1048576,MATCH(B270,ZonasPagasVigentes!$D$2:$D$1048576,0))","v":"Suspendida "},"inicia 08-05-2017/ El 11-04-2018 Operador corrige horario de operació informado (Anteriormente era de 6:00 a 12:00, ahora de 6:00 a 10:00); elimina B13R y se agrega 307cI, 315cI Ppo 12-01.2019",null,{"$f":"VLOOKUP(B270,ZonasPagasVigentes!$D:$BA,66,FALSE)","v":{"$error":"#REF!"}}]
["ZPM",332,{"$f":"INDEX(ZonasPagasVigentes!$B$2:$B$1048576,MATCH(B271,ZonasPagasVigentes!$D$2:$D$1048576,0))","v":"Activa"},"inicia 08-05-2017",null,{"$f":"VLOOKUP(B271,ZonasPagasVigentes!$D:$BA,66,FALSE)","v":{"$error":"#REF!"}}]
["ZPM",333,{"$f":"INDEX(ZonasPagasVigentes!$B$2:$B$1048576,MATCH(B272,ZonasPagasVigentes!$D$2:$D$1048576,0))","v":"Eliminada"},"inicia 26-05-2017",null,{"$f":"VLOOKUP(B272,ZonasPagasVigentes!$D:$BA,66,FALSE)","v":{"$error":"#REF!"}}]
["ZPM",334,{"$f":"INDEX(ZonasPagasVigentes!$B$2:$B$1048576,MATCH(B273,ZonasPagasVigentes!$D$2:$D$1048576,0))","v":"Activa"},"inicia 29-05-2017",null,{"$f":"VLOOKUP(B273,ZonasPagasVigentes!$D:$BA,66,FALSE)","v":{"$error":"#REF!"}}]
["ZPM",307,{"$f":"INDEX(ZonasPagasVigentes!$B$2:$B$1048576,MATCH(B274,ZonasPagasVigentes!$D$2:$D$1048576,0))","v":"Activa"},"inicia 21-04-2017",null,{"$f":"VLOOKUP(B274,ZonasPagasVigentes!$D:$BA,66,FALSE)","v":{"$error":"#REF!"}}]
["ZPM",335,{"$f":"INDEX(ZonasPagasVigentes!$B$2:$B$1048576,MATCH(B275,ZonasPagasVigentes!$D$2:$D$1048576,0))","v":"Activa"},"inicia 07-06-2017",null,{"$f":"VLOOKUP(B275,ZonasPagasVigentes!$D:$BA,66,FALSE)","v":{"$error":"#REF!"}}]
["ZPM",336,{"$f":"INDEX(ZonasPagasVigentes!$B$2:$B$1048576,MATCH(B276,ZonasPagasVigentes!$D$2:$D$1048576,0))","v":"Activa"},"inicia 19-06-2017",null,{"$f":"VLOOKUP(B276,ZonasPagasVigentes!$D:$BA,66,FALSE)","v":{"$error":"#REF!"}}]
["ZPM",337,{"$f":"INDEX(ZonasPagasVigentes!$B$2:$B$1048576,MATCH(B277,ZonasPagasVigentes!$D$2:$D$1048576,0))","v":"Eliminada"},"inicia 19-06-2017 / Comienza a operar como ZP Mixta (sólo entre U3 y U5), el 23-08-2017/ Suspendida el 21-09-2017",null,{"$f":"VLOOKUP(B277,ZonasPagasVigentes!$D:$BA,66,FALSE)","v":{"$error":"#REF!"}},"2017-09-21"]
["ZPM",338,{"$f":"INDEX(ZonasPagasVigentes!$B$2:$B$1048576,MATCH(B278,ZonasPagasVigentes!$D$2:$D$1048576,0))","v":"Eliminada"},"inicia 19-06-2017 / Comienza a operar como ZP Mixta (sólo entre U3 y U5), el 23-08-2017/ Suspendida el 21-09-2017",null,{"$f":"VLOOKUP(B278,ZonasPagasVigentes!$D:$BA,66,FALSE)","v":{"$error":"#REF!"}},"2017-09-21"]
["ZPM",339,{"$f":"INDEX(ZonasPagasVigentes!$B$2:$B$1048576,MATCH(B279,ZonasPagasVigentes!$D$2:$D$1048576,0))","v":"Activa"},"inicia 28-06-2017",null,{"$f":"VLOOKUP(B279,ZonasPagasVigentes!$D:$BA,66,FALSE)","v":{"$error":"#REF!"}}]
["ZPM",340,{"$f":"INDEX(ZonasPagasVigentes!$B$2:$B$1048576,MATCH(B280,ZonasPagasVigentes!$D$2:$D$1048576,0))","v":"Eliminada"},"inicia 05-07-2017 / Finaliza el 29-08-2017",null,{"$f":"VLOOKUP(B280,ZonasPagasVigentes!$D:$BA,66,FALSE)","v":{"$error":"#REF!"}},"2017-08-31"]
["ZPM",341,{"$f":"INDEX(ZonasPagasVigentes!$B$2:$B$1048576,MATCH(B281,ZonasPagasVigentes!$D$2:$D$1048576,0))","v":"Eliminada"},"inicia 05-07-2017",null,{"$f":"VLOOKUP(B281,ZonasPagasVigentes!$D:$BA,66,FALSE)","v":{"$error":"#REF!"}}]
["ZPM",342,{"$f":"INDEX(ZonasPagasVigentes!$B$2:$B$1048576,MATCH(B282,ZonasPagasVigentes!$D$2:$D$1048576,0))","v":"Eliminada"},"inicia 31-07-2017/ Finaliza debido a problemas de seguridad asociado a falta de luminaria",null,{"$f":"VLOOKUP(B282,ZonasPagasVigentes!$D:$BA,66,FALSE)","v":{"$error":"#REF!"}},"2018-03-08"]
["ZPM",343,{"$f":"INDEX(ZonasPagasVigentes!$B$2:$B$1048576,MATCH(B283,ZonasPagasVigentes!$D$2:$D$1048576,0))","v":"Activa"},"inicia 31-07-2017/ Extiende su horario el 01-08-2018 y absorbe horario de ZP18","L-S",{"$f":"VLOOKUP(B283,ZonasPagasVigentes!$D:$BA,66,FALSE)","v":{"$error":"#REF!"}},null,"2018-08-04"]
["ZPM",344,{"$f":"INDEX(ZonasPagasVigentes!$B$2:$B$1048576,MATCH(B284,ZonasPagasVigentes!$D$2:$D$1048576,0))","v":"Suspendida "},"inicia 31-07-2017 / Deja de ser ZPMixta hasta el 10-03-2018",null,{"$f":"VLOOKUP(B284,ZonasPagasVigentes!$D:$BA,66,FALSE)","v":{"$error":"#REF!"}}]
["ZPM",345,{"$f":"INDEX(ZonasPagasVigentes!$B$2:$B$1048576,MATCH(B285,ZonasPagasVigentes!$D$2:$D$1048576,0))","v":"Eliminada"},"inicia 31-07-2017",null,{"$f":"VLOOKUP(B285,ZonasPagasVigentes!$D:$BA,66,FALSE)","v":{"$error":"#REF!"}}]
["ZPM",346,{"$f":"INDEX(ZonasPagasVigentes!$B$2:$B$1048576,MATCH(B286,ZonasPagasVigentes!$D$2:$D$1048576,0))","v":"Eliminada"},"inicia 31-07-2017",null,{"$f":"VLOOKUP(B286,ZonasPagasVigentes!$D:$BA,66,FALSE)","v":{"$error":"#REF!"}}]
["ZPM",348,{"$f":"INDEX(ZonasPagasVigentes!$B$2:$B$1048576,MATCH(B287,ZonasPagasVigentes!$D$2:$D$1048576,0))","v":"Activa"},"inicia 10-08-2017/ El 15 de marzo de 2018 pasa a ser mixta, se agrega 421",null,{"$f":"VLOOKUP(B287,ZonasPagasVigentes!$D:$BA,66,FALSE)","v":{"$error":"#REF!"}}]
["ZPM",349,{"$f":"INDEX(ZonasPagasVigentes!$B$2:$B$1048576,MATCH(B288,ZonasPagasVigentes!$D$2:$D$1048576,0))","v":"Activa"},"inicia 22-08-2017",null,{"$f":"VLOOKUP(B288,ZonasPagasVigentes!$D:$BA,66,FALSE)","v":{"$error":"#REF!"}}]
["ZPM",350,{"$f":"INDEX(ZonasPagasVigentes!$B$2:$B$1048576,MATCH(B289,ZonasPagasVigentes!$D$2:$D$1048576,0))","v":"Activa"},"inicia 30-08-2017",null,{"$f":"VLOOKUP(B289,ZonasPagasVigentes!$D:$BA,66,FALSE)","v":{"$error":"#REF!"}}]
["ZPM",351,{"$f":"INDEX(ZonasPagasVigentes!$B$2:$B$1048576,MATCH(B290,ZonasPagasVigentes!$D$2:$D$1048576,0))","v":"Eliminada"},"inicia 01-09-2017/ suspendida por obras viales entre el 12-01-18 y el 07-03-18",null,{"$f":"VLOOKUP(B290,ZonasPagasVigentes!$D:$BA,66,FALSE)","v":{"$error":"#REF!"}}]
["ZPM",352,{"$f":"INDEX(ZonasPagasVigentes!$B$2:$B$1048576,MATCH(B291,ZonasPagasVigentes!$D$2:$D$1048576,0))","v":"Activa"},"inicia 01-09-2017 / Se agrega 1 validador el 22 de Mayo del 208",null,{"$f":"VLOOKUP(B291,ZonasPagasVigentes!$D:$BA,66,FALSE)","v":{"$error":"#REF!"}}]
["ZPM",353,{"$f":"INDEX(ZonasPagasVigentes!$B$2:$B$1048576,MATCH(B292,ZonasPagasVigentes!$D$2:$D$1048576,0))","v":"Activa"},"Inicia 05-09-2017/ baja operación 22 -11-17 y vuelve a operar 5-03-18 por trabajos",null,{"$f":"VLOOKUP(B292,ZonasPagasVigentes!$D:$BA,66,FALSE)","v":{"$error":"#REF!"}}]
["ZPM",354,{"$f":"INDEX(ZonasPagasVigentes!$B$2:$B$1048576,MATCH(B293,ZonasPagasVigentes!$D$2:$D$1048576,0))","v":"Activa"},"Inicia 03-10-2017",null,{"$f":"VLOOKUP(B293,ZonasPagasVigentes!$D:$BA,66,FALSE)","v":{"$error":"#REF!"}}]
["ZPM",355,{"$f":"INDEX(ZonasPagasVigentes!$B$2:$B$1048576,MATCH(B294,ZonasPagasVigentes!$D$2:$D$1048576,0))","v":"Activa"},"Fusión entre ex 117 y 195",null,{"$f":"VLOOKUP(B294,ZonasPagasVigentes!$D:$BA,66,FALSE)","v":{"$error":"#REF!"}}]
["ZPM",356,{"$f":"INDEX(ZonasPagasVigentes!$B$2:$B$1048576,MATCH(B295,ZonasPagasVigentes!$D$2:$D$1048576,0))","v":"Suspendida "},"Inicia 10-10-2017",null,{"$f":"VLOOKUP(B295,ZonasPagasVigentes!$D:$BA,66,FALSE)","v":{"$error":"#REF!"}}]
["ZPM",357,{"$f":"INDEX(ZonasPagasVigentes!$B$2:$B$1048576,MATCH(B296,ZonasPagasVigentes!$D$2:$D$1048576,0))","v":"Activa"},"Inicia 18-10-2017",null,{"$f":"VLOOKUP(B296,ZonasPagasVigentes!$D:$BA,66,FALSE)","v":{"$error":"#REF!"}}]
["ZPM",358,{"$f":"INDEX(ZonasPagasVigentes!$B$2:$B$1048576,MATCH(B297,ZonasPagasVigentes!$D$2:$D$1048576,0))","v":"Eliminada"},"Inicia 07-11-2017",null,{"$f":"VLOOKUP(B297,ZonasPagasVigentes!$D:$BA,66,FALSE)","v":{"$error":"#REF!"}}]
["ZPM",359,{"$f":"INDEX(ZonasPagasVigentes!$B$2:$B$1048576,MATCH(B298,ZonasPagasVigentes!$D$2:$D$1048576,0))","v":"Activa"},"Inicia 15-11-2017; Agrega B04vI, B10I PO 12-01.2019",null,{"$f":"VLOOKUP(B298,ZonasPagasVigentes!$D:$BA,66,FALSE)","v":{"$error":"#REF!"}}]
["ZPM",360,{"$f":"INDEX(ZonasPagasVigentes!$B$2:$B$1048576,MATCH(B299,ZonasPagasVigentes!$D$2:$D$1048576,0))","v":"Suspendida "},"Inicia 20-11-2017; Elimina B13R PO 12-01-2019 y agrega 307cI Y B12cI",null,{"$f":"VLOOKUP(B299,ZonasPagasVigentes!$D:$BA,66,FALSE)","v":{"$error":"#REF!"}}]
["ZPM",361,{"$f":"INDEX(ZonasPagasVigentes!$B$2:$B$1048576,MATCH(B300,ZonasPagasVigentes!$D$2:$D$1048576,0))","v":"Eliminada"},"Inicia operación 25-01-2018",null,{"$f":"VLOOKUP(B300,ZonasPagasVigentes!$D:$BA,66,FALSE)","v":{"$error":"#REF!"}}]
["ZPM",362,{"$f":"INDEX(ZonasPagasVigentes!$B$2:$B$1048576,MATCH(B301,ZonasPagasVigentes!$D$2:$D$1048576,0))","v":"Eliminada"},"Inicia operación 25-01-2018","Laboral",{"$f":"VLOOKUP(B301,ZonasPagasVigentes!$D:$BA,66,FALSE)","v":{"$error":"#REF!"}},"2018-08-31"]
["ZPM",363,{"$f":"INDEX(ZonasPagasVigentes!$B$2:$B$1048576,MATCH(B302,ZonasPagasVigentes!$D$2:$D$1048576,0))","v":"Eliminada"},"Inicia 01-12-2017","Laboral",{"$f":"VLOOKUP(B302,ZonasPagasVigentes!$D:$BA,66,FALSE)","v":{"$error":"#REF!"}},"2018-08-31"]
["ZPM",364,{"$f":"INDEX(ZonasPagasVigentes!$B$2:$B$1048576,MATCH(B303,ZonasPagasVigentes!$D$2:$D$1048576,0))","v":"Eliminada"},"Inicia 01-12-2017","Laboral",{"$f":"VLOOKUP(B303,ZonasPagasVigentes!$D:$BA,66,FALSE)","v":{"$error":"#REF!"}},"2018-08-31"]
["ZPM",365,{"$f":"INDEX(ZonasPagasVigentes!$B$2:$B$1048576,MATCH(B304,ZonasPagasVigentes!$D$2:$D$1048576,0))","v":"Eliminada"},"Inicia 07-12-2017",null,{"$f":"VLOOKUP(B304,ZonasPagasVigentes!$D:$BA,66,FALSE)","v":{"$error":"#REF!"}},null,null,null,"2018-07-22"]
["ZPM",366,{"$f":"INDEX(ZonasPagasVigentes!$B$2:$B$1048576,MATCH(B305,ZonasPagasVigentes!$D$2:$D$1048576,0))","v":"Eliminada"},"Inicia 07-12-2017/ El 01 de julio de 2018 comienza a operar día domingo",null,{"$f":"VLOOKUP(B305,ZonasPagasVigentes!$D:$BA,66,FALSE)","v":{"$error":"#REF!"}},null,null,null,"2018-07-01"]
["ZPM",367,{"$f":"INDEX(ZonasPagasVigentes!$B$2:$B$1048576,MATCH(B306,ZonasPagasVigentes!$D$2:$D$1048576,0))","v":"Eliminada"},"Inicia 07-12-2017 / sufre modificaciones en sus servicios entre el 12-01-2018 y el 06-03-2018. Recibe servicios de ZP 351 suspendida./ Desde 01-07-2018 opera Domingo entre 11:00 y 19:00",null,{"$f":"VLOOKUP(B306,ZonasPagasVigentes!$D:$BA,66,FALSE)","v":{"$error":"#REF!"}}]
["ZPM",368,{"$f":"INDEX(ZonasPagasVigentes!$B$2:$B$1048576,MATCH(B307,ZonasPagasVigentes!$D$2:$D$1048576,0))","v":"Eliminada"},"Inicia 07-12-2017/ El 01 de julio de 2018 comienza a operar día domingo",null,{"$f":"VLOOKUP(B307,ZonasPagasVigentes!$D:$BA,66,FALSE)","v":{"$error":"#REF!"}},null,null,null,"2018-07-01"]
["ZPM",369,{"$f":"INDEX(ZonasPagasVigentes!$B$2:$B$1048576,MATCH(B308,ZonasPagasVigentes!$D$2:$D$1048576,0))","v":"Eliminada"},"operador decide supender su apertura por temas logisticos",null,{"$f":"VLOOKUP(B308,ZonasPagasVigentes!$D:$BA,66,FALSE)","v":{"$error":"#REF!"}},"nunca operó"]
["ZPM",370,{"$f":"INDEX(ZonasPagasVigentes!$B$2:$B$1048576,MATCH(B309,ZonasPagasVigentes!$D$2:$D$1048576,0))","v":"Eliminada"},"operador decide supender su apertura por temas logisticos",null,{"$f":"VLOOKUP(B309,ZonasPagasVigentes!$D:$BA,66,FALSE)","v":{"$error":"#REF!"}},"nunca operó"]
["ZPM",371,{"$f":"INDEX(ZonasPagasVigentes!$B$2:$B$1048576,MATCH(B310,ZonasPagasVigentes!$D$2:$D$1048576,0))","v":"Activa"},"Inicia 11-12-2017/ Extiende su horario desde el 01-08-2018 ya que absorve el horario de ZP10",null,{"$f":"VLOOKUP(B310,ZonasPagasVigentes!$D:$BA,66,FALSE)","v":{"$error":"#REF!"}}]
["ZPM",372,{"$f":"INDEX(ZonasPagasVigentes!$B$2:$B$1048576,MATCH(B311,ZonasPagasVigentes!$D$2:$D$1048576,0))","v":"Activa"},"Inicia 11-12-2017",null,{"$f":"VLOOKUP(B311,ZonasPagasVigentes!$D:$BA,66,FALSE)","v":{"$error":"#REF!"}}]
["ZPM",373,{"$f":"INDEX(ZonasPagasVigentes!$B$2:$B$1048576,MATCH(B312,ZonasPagasVigentes!$D$2:$D$1048576,0))","v":"Activa"},"Inicia 13-12-2017",null,{"$f":"VLOOKUP(B312,ZonasPagasVigentes!$D:$BA,66,FALSE)","v":{"$error":"#REF!"}}]
["ZPM",374,{"$f":"INDEX(ZonasPagasVigentes!$B$2:$B$1048576,MATCH(B313,ZonasPagasVigentes!$D$2:$D$1048576,0))","v":"Activa"},"Inicia 13-12-2017",null,{"$f":"VLOOKUP(B313,ZonasPagasVigentes!$D:$BA,66,FALSE)","v":{"$error":"#REF!"}}]
["ZPM",375,{"$f":"INDEX(ZonasPagasVigentes!$B$2:$B$1048576,MATCH(B314,ZonasPagasVigentes!$D$2:$D$1048576,0))","v":"Activa"},"Inicia 13-12-2017; elimina U1, AGREGA U5 PO 12-01-2019",null,{"$f":"VLOOKUP(B314,ZonasPagasVigentes!$D:$BA,66,FALSE)","v":{"$error":"#REF!"}}]
["ZPM",376,{"$f":"INDEX(ZonasPagasVigentes!$B$2:$B$1048576,MATCH(B315,ZonasPagasVigentes!$D$2:$D$1048576,0))","v":"Suspendida "},"Inicia 13-12-2017; elimina U1, AGREGA U4 - U5 PO 12-01-2019",null,{"$f":"VLOOKUP(B315,ZonasPagasVigentes!$D:$BA,66,FALSE)","v":{"$error":"#REF!"}}]
["ZPM",377,{"$f":"INDEX(ZonasPagasVigentes!$B$2:$B$1048576,MATCH(B316,ZonasPagasVigentes!$D$2:$D$1048576,0))","v":"Activa"},"Inicia 13-12-2017; elimina U1, AGREGA U5 PO 12-01-2019",null,{"$f":"VLOOKUP(B316,ZonasPagasVigentes!$D:$BA,66,FALSE)","v":{"$error":"#REF!"}}]
["ZPM",378,{"$f":"INDEX(ZonasPagasVigentes!$B$2:$B$1048576,MATCH(B317,ZonasPagasVigentes!$D$2:$D$1048576,0))","v":"Activa"},"Inicia 13-12-2017; elimina U1, AGREGA U5  Y I18I, 118I PO 12-01.19",null,{"$f":"VLOOKUP(B317,ZonasPagasVigentes!$D:$BA,66,FALSE)","v":{"$error":"#REF!"}}]
["ZPM",379,{"$f":"INDEX(ZonasPagasVigentes!$B$2:$B$1048576,MATCH(B318,ZonasPagasVigentes!$D$2:$D$1048576,0))","v":"Suspendida "},"Inicia 19-12-2017",null,{"$f":"VLOOKUP(B318,ZonasPagasVigentes!$D:$BA,66,FALSE)","v":{"$error":"#REF!"}}]
["ZPM",380,{"$f":"INDEX(ZonasPagasVigentes!$B$2:$B$1048576,MATCH(B319,ZonasPagasVigentes!$D$2:$D$1048576,0))","v":"Eliminada"},"Inicia 19-12-2017",null,{"$f":"VLOOKUP(B319,ZonasPagasVigentes!$D:$BA,66,FALSE)","v":{"$error":"#REF!"}}]
["ZPM",381,{"$f":"INDEX(ZonasPagasVigentes!$B$2:$B$1048576,MATCH(B320,ZonasPagasVigentes!$D$2:$D$1048576,0))","v":"Activa"},"Inicia 22-12-2017 / Desde el 01-08-2018 extiede su horario absorviendolo de la ZP147",null,{"$f":"VLOOKUP(B320,ZonasPagasVigentes!$D:$BA,66,FALSE)","v":{"$error":"#REF!"}}]
["ZPM",382,{"$f":"INDEX(ZonasPagasVigentes!$B$2:$B$1048576,MATCH(B321,ZonasPagasVigentes!$D$2:$D$1048576,0))","v":"Activa"},"Inicia 22-12-2017",null,{"$f":"VLOOKUP(B321,ZonasPagasVigentes!$D:$BA,66,FALSE)","v":{"$error":"#REF!"}}]
["ZPM",{"$f":"+ZonasPagasVigentes!D322","v":383},{"$f":"INDEX(ZonasPagasVigentes!$B$2:$B$1048576,MATCH(B322,ZonasPagasVigentes!$D$2:$D$1048576,0))","v":"Eliminada"},"Inicia 05-01-2018","L",{"$f":"VLOOKUP(B322,ZonasPagasVigentes!$D:$BA,66,FALSE)","v":{"$error":"#REF!"}},"2018-07-15"]
["ZPM",{"$f":"+ZonasPagasVigentes!D323","v":384},{"$f":"INDEX(ZonasPagasVigentes!$B$2:$B$1048576,MATCH(B323,ZonasPagasVigentes!$D$2:$D$1048576,0))","v":"Eliminada"},"Inicia 05-01-2018",null,{"$f":"VLOOKUP(B323,ZonasPagasVigentes!$D:$BA,66,FALSE)","v":{"$error":"#REF!"}}]
["ZPM",{"$f":"+ZonasPagasVigentes!D324","v":385},{"$f":"INDEX(ZonasPagasVigentes!$B$2:$B$1048576,MATCH(B324,ZonasPagasVigentes!$D$2:$D$1048576,0))","v":"Activa"},"Inicia 05-01-2018",null,{"$f":"VLOOKUP(B324,ZonasPagasVigentes!$D:$BA,66,FALSE)","v":{"$error":"#REF!"}}]
["ZPM",{"$f":"+ZonasPagasVigentes!D325","v":386},{"$f":"INDEX(ZonasPagasVigentes!$B$2:$B$1048576,MATCH(B325,ZonasPagasVigentes!$D$2:$D$1048576,0))","v":"Activa"},"Inicia 08-01-2018",null,{"$f":"VLOOKUP(B325,ZonasPagasVigentes!$D:$BA,66,FALSE)","v":{"$error":"#REF!"}}]
["ZPM",{"$f":"+ZonasPagasVigentes!D326","v":387},{"$f":"INDEX(ZonasPagasVigentes!$B$2:$B$1048576,MATCH(B326,ZonasPagasVigentes!$D$2:$D$1048576,0))","v":"Eliminada"},"Inicia 05-01-2019",null,{"$f":"VLOOKUP(B326,ZonasPagasVigentes!$D:$BA,66,FALSE)","v":{"$error":"#REF!"}}]
["ZPM",{"$f":"+ZonasPagasVigentes!D327","v":388},{"$f":"INDEX(ZonasPagasVigentes!$B$2:$B$1048576,MATCH(B327,ZonasPagasVigentes!$D$2:$D$1048576,0))","v":"Activa"},"Inicia 05-01-2018",null,{"$f":"VLOOKUP(B327,ZonasPagasVigentes!$D:$BA,66,FALSE)","v":{"$error":"#REF!"}}]
["ZPM",{"$f":"+ZonasPagasVigentes!D328","v":389},{"$f":"INDEX(ZonasPagasVigentes!$B$2:$B$1048576,MATCH(B328,ZonasPagasVigentes!$D$2:$D$1048576,0))","v":"Activa"},"Inicia 08-01-2019",null,{"$f":"VLOOKUP(B328,ZonasPagasVigentes!$D:$BA,66,FALSE)","v":{"$error":"#REF!"}}]
["ZPM",{"$f":"+ZonasPagasVigentes!D329","v":390},{"$f":"INDEX(ZonasPagasVigentes!$B$2:$B$1048576,MATCH(B329,ZonasPagasVigentes!$D$2:$D$1048576,0))","v":"Activa"},"Inicia 05-01-2018",null,{"$f":"VLOOKUP(B329,ZonasPagasVigentes!$D:$BA,66,FALSE)","v":{"$error":"#REF!"}}]
["ZPM",391,{"$f":"INDEX(ZonasPagasVigentes!$B$2:$B$1048576,MATCH(B330,ZonasPagasVigentes!$D$2:$D$1048576,0))","v":"Eliminada"},null,null,{"$f":"VLOOKUP(B330,ZonasPagasVigentes!$D:$BA,66,FALSE)","v":{"$error":"#REF!"}}]
["ZPM",392,{"$f":"INDEX(ZonasPagasVigentes!$B$2:$B$1048576,MATCH(B331,ZonasPagasVigentes!$D$2:$D$1048576,0))","v":"Activa"},null,null,{"$f":"VLOOKUP(B331,ZonasPagasVigentes!$D:$BA,66,FALSE)","v":{"$error":"#REF!"}}]
["ZPM",393,{"$f":"INDEX(ZonasPagasVigentes!$B$2:$B$1048576,MATCH(B332,ZonasPagasVigentes!$D$2:$D$1048576,0))","v":"Activa"},"Extiende su horario el 01-08-2018 y absorbe horario de ZO121",null,{"$f":"VLOOKUP(B332,ZonasPagasVigentes!$D:$BA,66,FALSE)","v":{"$error":"#REF!"}}]
["ZPM",394,{"$f":"INDEX(ZonasPagasVigentes!$B$2:$B$1048576,MATCH(B333,ZonasPagasVigentes!$D$2:$D$1048576,0))","v":"Activa"},null,null,{"$f":"VLOOKUP(B333,ZonasPagasVigentes!$D:$BA,66,FALSE)","v":{"$error":"#REF!"}}]
["ZPM",395,{"$f":"INDEX(ZonasPagasVigentes!$B$2:$B$1048576,MATCH(B334,ZonasPagasVigentes!$D$2:$D$1048576,0))","v":"Activa"},"Extiende su horario el 01-08-2018 y absorbe horario de ex ZP120",null,{"$f":"VLOOKUP(B334,ZonasPagasVigentes!$D:$BA,66,FALSE)","v":{"$error":"#REF!"}}]
["ZPM",396,{"$f":"INDEX(ZonasPagasVigentes!$B$2:$B$1048576,MATCH(B335,ZonasPagasVigentes!$D$2:$D$1048576,0))","v":"Activa"},"Extiende su horario el 01-07-2018",null,{"$f":"VLOOKUP(B335,ZonasPagasVigentes!$D:$BA,66,FALSE)","v":{"$error":"#REF!"}}]
["ZPM",397,{"$f":"INDEX(ZonasPagasVigentes!$B$2:$B$1048576,MATCH(B336,ZonasPagasVigentes!$D$2:$D$1048576,0))","v":"Eliminada"},"Extiende su horario el 01-08-2018 y absorbe horario de ZP190; Agrega 412R PO 12-01-2019","L-S-D",{"$f":"VLOOKUP(B336,ZonasPagasVigentes!$D:$BA,66,FALSE)","v":{"$error":"#REF!"}}]
["ZPM",398,{"$f":"INDEX(ZonasPagasVigentes!$B$2:$B$1048576,MATCH(B337,ZonasPagasVigentes!$D$2:$D$1048576,0))","v":"Eliminada"},null,null,{"$f":"VLOOKUP(B337,ZonasPagasVigentes!$D:$BA,66,FALSE)","v":{"$error":"#REF!"}}]
["ZPM",399,{"$f":"INDEX(ZonasPagasVigentes!$B$2:$B$1048576,MATCH(B338,ZonasPagasVigentes!$D$2:$D$1048576,0))","v":"Activa"},null,null,{"$f":"VLOOKUP(B338,ZonasPagasVigentes!$D:$BA,66,FALSE)","v":{"$error":"#REF!"}}]
["ZPM",400,{"$f":"INDEX(ZonasPagasVigentes!$B$2:$B$1048576,MATCH(B339,ZonasPagasVigentes!$D$2:$D$1048576,0))","v":"Eliminada"},"El lunes 18 de junio pasa a ser ZP Mixta (previo era exclusiva de U7), se incorpora 209R y 209eR / Eliminada por vandaismos a monitores","L",{"$f":"VLOOKUP(B339,ZonasPagasVigentes!$D:$BA,66,FALSE)","v":{"$error":"#REF!"}},"2018-11-19"]
["ZPM",401,{"$f":"INDEX(ZonasPagasVigentes!$B$2:$B$1048576,MATCH(B340,ZonasPagasVigentes!$D$2:$D$1048576,0))","v":"Activa"},null,null,{"$f":"VLOOKUP(B340,ZonasPagasVigentes!$D:$BA,66,FALSE)","v":{"$error":"#REF!"}}]
["ZPM",402,{"$f":"INDEX(ZonasPagasVigentes!$B$2:$B$1048576,MATCH(B341,ZonasPagasVigentes!$D$2:$D$1048576,0))","v":"Activa"},null,null,{"$f":"VLOOKUP(B341,ZonasPagasVigentes!$D:$BA,66,FALSE)","v":{"$error":"#REF!"}}]
["ZPM",403,{"$f":"INDEX(ZonasPagasVigentes!$B$2:$B$1048576,MATCH(B342,ZonasPagasVigentes!$D$2:$D$1048576,0))","v":"Activa"},null,null,{"$f":"VLOOKUP(B342,ZonasPagasVigentes!$D:$BA,66,FALSE)","v":{"$error":"#REF!"}}]
["ZPM",404,{"$f":"INDEX(ZonasPagasVigentes!$B$2:$B$1048576,MATCH(B343,ZonasPagasVigentes!$D$2:$D$1048576,0))","v":"Suspendida "},null,null,{"$f":"VLOOKUP(B343,ZonasPagasVigentes!$D:$BA,66,FALSE)","v":{"$error":"#REF!"}}]
["ZPM",405,{"$f":"INDEX(ZonasPagasVigentes!$B$2:$B$1048576,MATCH(B344,ZonasPagasVigentes!$D$2:$D$1048576,0))","v":"Activa"},null,null,{"$f":"VLOOKUP(B344,ZonasPagasVigentes!$D:$BA,66,FALSE)","v":{"$error":"#REF!"}}]
["ZPM",406,{"$f":"INDEX(ZonasPagasVigentes!$B$2:$B$1048576,MATCH(B345,ZonasPagasVigentes!$D$2:$D$1048576,0))","v":"Activa"},null,null,{"$f":"VLOOKUP(B345,ZonasPagasVigentes!$D:$BA,66,FALSE)","v":{"$error":"#REF!"}}]
["ZPM",407,{"$f":"INDEX(ZonasPagasVigentes!$B$2:$B$1048576,MATCH(B346,ZonasPagasVigentes!$D$2:$D$1048576,0))","v":"Activa"},null,null,{"$f":"VLOOKUP(B346,ZonasPagasVigentes!$D:$BA,66,FALSE)","v":{"$error":"#REF!"}}]
["ZPM",408,{"$f":"INDEX(ZonasPagasVigentes!$B$2:$B$1048576,MATCH(B347,ZonasPagasVigentes!$D$2:$D$1048576,0))","v":"Suspendida "},null,null,{"$f":"VLOOKUP(B347,ZonasPagasVigentes!$D:$BA,66,FALSE)","v":{"$error":"#REF!"}}]
["ZPM",409,{"$f":"INDEX(ZonasPagasVigentes!$B$2:$B$1048576,MATCH(B348,ZonasPagasVigentes!$D$2:$D$1048576,0))","v":"Suspendida "},"Elimina B07I PO 12-01-2019 y Agrega 307cI ",null,{"$f":"VLOOKUP(B348,ZonasPagasVigentes!$D:$BA,66,FALSE)","v":{"$error":"#REF!"}}]
["ZPM",410,{"$f":"INDEX(ZonasPagasVigentes!$B$2:$B$1048576,MATCH(B349,ZonasPagasVigentes!$D$2:$D$1048576,0))","v":"Activa"},"Agrega 271R PO 12-01.2019",null,{"$f":"VLOOKUP(B349,ZonasPagasVigentes!$D:$BA,66,FALSE)","v":{"$error":"#REF!"}}]
["ZPM",411,{"$f":"INDEX(ZonasPagasVigentes!$B$2:$B$1048576,MATCH(B350,ZonasPagasVigentes!$D$2:$D$1048576,0))","v":"Activa"},null,null,{"$f":"VLOOKUP(B350,ZonasPagasVigentes!$D:$BA,66,FALSE)","v":{"$error":"#REF!"}}]
["ZPM",412,{"$f":"INDEX(ZonasPagasVigentes!$B$2:$B$1048576,MATCH(B351,ZonasPagasVigentes!$D$2:$D$1048576,0))","v":"Activa"},"Elimina 201eI y agrega D03I, 513vR, ademas se incluye UN 4 Y 5 PO 12-01-2019",null,{"$f":"VLOOKUP(B351,ZonasPagasVigentes!$D:$BA,66,FALSE)","v":{"$error":"#REF!"}}]
["ZPM",413,{"$f":"INDEX(ZonasPagasVigentes!$B$2:$B$1048576,MATCH(B352,ZonasPagasVigentes!$D$2:$D$1048576,0))","v":"Eliminada"},"Agrega 271R PO 12-01.2019",null,{"$f":"VLOOKUP(B352,ZonasPagasVigentes!$D:$BA,66,FALSE)","v":{"$error":"#REF!"}}]
["ZPM",414,{"$f":"INDEX(ZonasPagasVigentes!$B$2:$B$1048576,MATCH(B353,ZonasPagasVigentes!$D$2:$D$1048576,0))","v":"Suspendida "},null,null,"2018-07-20"]
["ZPM",415,{"$f":"INDEX(ZonasPagasVigentes!$B$2:$B$1048576,MATCH(B354,ZonasPagasVigentes!$D$2:$D$1048576,0))","v":"Activa"},null,null,"2018-10-03"]
["ZPM",416,{"$f":"INDEX(ZonasPagasVigentes!$B$2:$B$1048576,MATCH(B355,ZonasPagasVigentes!$D$2:$D$1048576,0))","v":"Activa"},null,null,"2018-10-01"]
["ZPM",417,{"$f":"INDEX(ZonasPagasVigentes!$B$2:$B$1048576,MATCH(B356,ZonasPagasVigentes!$D$2:$D$1048576,0))","v":"Eliminada"},"Agrega 271R PO 12-01.2019",null,"2018-11-08"]
["ZPM",418,{"$f":"INDEX(ZonasPagasVigentes!$B$2:$B$1048576,MATCH(B357,ZonasPagasVigentes!$D$2:$D$1048576,0))","v":"Eliminada"},null,null,"2018-10-22"]
["ZPM",419,{"$f":"INDEX(ZonasPagasVigentes!$B$2:$B$1048576,MATCH(B358,ZonasPagasVigentes!$D$2:$D$1048576,0))","v":"Eliminada"},null,null,"2018-10-22"]
["ZPM",420,{"$f":"INDEX(ZonasPagasVigentes!$B$2:$B$1048576,MATCH(B359,ZonasPagasVigentes!$D$2:$D$1048576,0))","v":"Eliminada"},null,null,"2018-10-22"]
["ZPM",421,{"$f":"INDEX(ZonasPagasVigentes!$B$2:$B$1048576,MATCH(B360,ZonasPagasVigentes!$D$2:$D$1048576,0))","v":"Eliminada"},null,null,"2018-10-22"]
["ZPM",422,{"$f":"INDEX(ZonasPagasVigentes!$B$2:$B$1048576,MATCH(B361,ZonasPagasVigentes!$D$2:$D$1048576,0))","v":"Eliminada"},null,null,"2018-10-22"]
["ZPM",423,{"$f":"INDEX(ZonasPagasVigentes!$B$2:$B$1048576,MATCH(B362,ZonasPagasVigentes!$D$2:$D$1048576,0))","v":"Activa"},null,null,"2018-11-07"]
["ZPM",424,{"$f":"INDEX(ZonasPagasVigentes!$B$2:$B$1048576,MATCH(B363,ZonasPagasVigentes!$D$2:$D$1048576,0))","v":"Activa"},null,null,"2018-12-15"]
[null,425,{"$f":"INDEX(ZonasPagasVigentes!$B$2:$B$1048576,MATCH(B364,ZonasPagasVigentes!$D$2:$D$1048576,0))","v":"Eliminada"}]
["ZP",426,{"$f":"INDEX(ZonasPagasVigentes!$B$2:$B$1048576,MATCH(B365,ZonasPagasVigentes!$D$2:$D$1048576,0))","v":"Suspendida "},"Inicio de Operación 27-12-2018","Laboral","2018-12-27",null,"2018-12-27"]
[null,427,{"$f":"INDEX(ZonasPagasVigentes!$B$2:$B$1048576,MATCH(B366,ZonasPagasVigentes!$D$2:$D$1048576,0))","v":"Eliminada"},"Agrega 409I PO 12-01-2019"]
[null,428,{"$f":"INDEX(ZonasPagasVigentes!$B$2:$B$1048576,MATCH(B367,ZonasPagasVigentes!$D$2:$D$1048576,0))","v":"Activa"}]
["ZP",429,"Activa","Incio de Operación 30-01-2019","Laboral - Sabados ","2019-01-30",null,"2019-01-30"]
["ZP",430,"Activa","Inicio de operación 30-01-2019, apertura Implementacion L3","Laboral","2019-01-30"]
["ZP",431,"Activa","Inicio de Operación 31-01-2019, apertura implementacion L3","Laboral","2019-01-31"]
["ZP COMPARTIDA",432,"Activa","Inciio de Operación 08-02-2019","Laboral","2007-10-28"]
["ZP COMPARTIDA",433,"Activa","Inciio de Operación 18-02-2019","Laboral- Sabados ","2019-02-18",null,"2019-02-18"]
["ZP COMPARTIDA",434,"Activa","Inicio de Operación 20-02-2019","Laboral","2019-02-20"]
["ZP COMPARTIDA",435,"Activa","Inicio de Operación 20-02-2019","Laboral ","2019-02-20"]
["ZP COMPARTIDA",436,"Activa","Iniico de Operación 20-02-2019","Laboral","2019-02-20"]
["ZP COMPARTIDA",437,"Activa","Iniico de Operación 20-02-2020","Laboral ","2019-02-20"]
["ZP COMPARTIDA",438,"Activa","Inicio de Operación 22-02-2019","Laboral - Sabados - Domingos","2019-02-22",null,"2019-02-22",null,"2019-04-09"]
["ZP COMPARTIDA",439,"Activa","Inicio de Operación 22-02-2019","Laboral ","2019-02-22"]
["ZP",440,"Activa","Inicio de operación implementación L3","Laboral ","2019-03-01"]
["ZP COMPARTIDA",441,"Activa","Incio de Operación 01-03-2019","Laboral","2019-02-01"]
["ZP",442,"Activa","Inicio de operación 21-03-2019","Laboral ","2019-03-21"]
["ZP COMPARTIDA",443,"Activa","Iniico de operación 01-04-2019","Laboral ","2019-04-01"]
["ZP",444,"Activa","Inicio de operación 03-04-2019","Laboral ","2019-04-03"]
["ZP COMPARTIDA",445,"Activa","Inicio de operación 07-05-2019","Laboral ","2019-05-07"]
["ZP",446,"Activa","Inicio de operación 07-05-2020","Laboral ","2019-05-07"]

{"sheet":"ZonasPagasVigentes","index":3,"n_rows":489,"n_cols":56,"rows_kept":489,"cut":false,"hidden":false,"merged":[[142,0,153,0],[139,0,141,0],[0,17,0,20],[0,21,0,24],[0,25,0,28]]}
[null,"Fecha Vigencia","2021-01-31",null,null,"|",null,null,null,null,null,null,null,null,null,null,null,"Horario Laboral",null,null,null,"Horario Sábado",null,null,null,"Horario Domingo",null,null,null,null,null,null,null,null,null,null,null,null,null,null,null,null,null,null,null,null,null,null,null,null,null,null,null,null,null,"   "]
["Contador","Estado","Tipo Punto","Código ZP","Patente","Código Parada Usuario_1","Código Parada Usuario_2","Código Parada TS_1","Código Parada TS_2","Comuna","Nombre Parada","UN Principal","UN Secundaria 1","UN Secundaria 2","UN Secundaria 3","UN Secundaria 4","UN Secundaria 5","Inicio 1","Término 1","Inicio 2","Término 2","Inicio 1","Término 1","Inicio 2","Término 2","Inicio 1","Término 1","Inicio 2","Término 2","S1","S2","S3","S4","S5","S6","S7","S8","S9","S10","S11","S12","S13","S14","S15","S16","S17","S18","S19","S20","S21","N° Validador EXT MK Rojo","N° Monitores","Inicio de Operación","X","Y","Versión Archivo Sonda-TIC"]
[1,"Activa","ZP COMPARTIDA",1,"RM-0045","PC160","-","E-17-140-PO-7","-","LAS CONDES","Parada 4 / (M) Escuela Militar","U4","U6","U5","-","-","-","06:00:00","11:00:00","-","-","-","-","-","-","-","-","-","-","406I","426I","430I","406cI","C01I","C01cI",null,null,null,null,null,null,null,null,null,null,null,null,null,null,null,5,5,"2007-02-19",352880.2,6301757.1799999997,"ZONA PAGA V268"]
[1,"Activa","ZP COMPARTIDA",2,"RM-0057","PC586","-","E-17-140-PO-10","-","LAS CONDES","Parada 3 / (M) Escuela   Militar","U6","U4","U5","U7","-","-","06:30:00","15:30:00","-","-","-","-","-","-","-","-","-","-","401I","407I","421I","401cI","C02R",null,null,null,null,null,null,null,null,null,null,null,null,null,null,null,null,4,4,"2007-02-20",352941.86,6301787.8399999999,"ZONA PAGA V268"]
[1,"Activa","ZP COMPARTIDA",3,"RM-0005","PC207","-","T-14-110-OP-75","-","PROVIDENCIA","Parada 2 / (M) Tobalaba","U4","U7","U6","-","-","-","06:30:00","11:00:00","-","-","-","-","-","-","-","-","-","-","405I","405cR","C03R",null,null,null,null,null,null,null,null,null,null,null,null,null,null,null,null,null,null,3,3,"2007-02-26",350797.51,6301264.2400000002,"ZONA PAGA V268"]
[1,"Eliminada","ZP",4,"RM-0027","PC738","-","E-14-170-NS-5","-","PROVIDENCIA","Parada 4 / (M) Tobalaba","U6","-","-","-","-","-","06:30:00","10:30:00","17:00:00","20:00:00","-","-","-","-","-","-","-","-","C06R",null,null,null,null,null,null,null,null,null,null,null,null,null,null,null,null,null,null,null,null,null,"-","2007-03-05",351150.01,6301132.9100000001,"ZONA PAGA V268"]
[1,"Eliminada","ZP",5,"RM-0009","PC290","-","T-17-145-PO-5","-","LAS CONDES","Nueva Las Condes esq. / Sn. Francisco de Asís","U4","-","-","-","-","-","17:30:00","19:30:00","-","-","-","-","-","-","-","-","-","-","405R","406R","406cR","409I","426I","430I",null,null,null,null,null,null,null,null,null,null,null,null,null,null,null,null,3,"2007-03-05",358827.31,6306288.2699999996,"ZONA PAGA V268"]
[1,"Eliminada","ZP COMPARTIDA",6,"RM-0053","PC1147","-","E-14-128-PO-2","-","PROVIDENCIA","Parada 2 / Plaza Italia","U4","U7","-","-","-","-","06:30:00","11:00:00","-","-","-","-","-","-","-","-","-","-","405I","405cR",null,null,null,null,null,null,null,null,null,null,null,null,null,null,null,null,null,null,null,null,3,"2007-03-05",348159,6299046,"ZONA PAGA V268"]
[1,"Suspendida ","ZP",7,"RM-0031","PC145","-","E-14-134-SN-30","-","PROVIDENCIA","Parada 3 / Plaza Italia","U3","-","-","-","-","-","06:30:00","21:30:00","-","-","-","-","-","-","-","-","-","-","307I","307eR","314I","315eR",null,null,null,null,null,null,null,null,null,null,null,null,null,null,null,null,null,2,4,"2007-03-05",348018.51,6299005.2400000002,"ZONA PAGA V268"]
[1,"Eliminada","ZP",8,"RM-0013","PJ112","-","E-9-53-OP-15","-","LO PRADO","Parada 7 / (M) Las Rejas","U4","-","-","-","-","-","17:00:00","21:00:00","-","-","-","-","-","-","-","-","-","-","401R","405R","419R","421R","423R","413cR","431cR","106R",null,null,null,null,null,null,null,null,null,null,null,null,null,null,3,"2007-03-05",341288.61,6296688.5599999996,"ZONA PAGA V268"]
[1,"Eliminada","ZP COMPARTIDA",9,"RM-0017","PI386","-","E-13-54-SN-10","-","MAIPÚ","Parada 1 / (M) Plaza   de Maipú","U4","U1","U3","-","-","-","06:30:00","11:00:00","-","-","-","-","-","-","-","-","-","-","106I","110R","111R","I09I","I09cI","401I","405I","421I","413cI","413vI","431cI","431vI",null,null,null,null,null,null,null,null,null,null,3,"2007-03-05",336791.45,6290866.5499999998,"ZONA PAGA V268"]
[1,"Eliminada","ZP",10,"RM-0035","PF176","-","E-34-270-NS-70","-","PUENTE ALTO","Parada 3 / (M) Plaza de   Puente Alto","U7","-","-","-","-","-","15:00:00","22:30:00","-","-","-","-","-","-","-","-","-","-","F01I","F01cR","F03I","F03cI","F10R","F11R","F13R","F13cR","F14I","712R","F29I",null,null,null,null,null,null,null,null,null,null,null,4,"2007-03-05",353788.28,6280015.0499999998,"ZONA PAGA V268"]
[1,"Eliminada","ZP",11,"RM-0041","PA115","-","E-20-205-SN-65","-","SANTIAGO","Parada 6 / (M) Santa Lucía","U2","-","-","-","-","-","16:00:00","21:00:00","-","-","-","-","-","-","-","-","-","-","204I","204eI",null,null,null,null,null,null,null,null,null,null,null,null,null,null,null,null,null,null,null,null,2,"2007-03-05",347012.18,6298353.4299999997,"ZONA PAGA V268"]
[1,"Activa","ZP COMPARTIDA",12,"RM-0023","PA380","-","E-20-290-OP-15","-","SANTIAGO","Parada 4 / Estación Mapocho","U5","U6","-","-","-","-","07:00:00","20:00:00","-","-","07:00:00","20:00:00","-","-","-","-","-","-","408R","408eR","B20R",null,null,null,null,null,null,null,null,null,null,null,null,null,null,null,null,null,null,3,3,"2008-05-08",346484.64,6299537.6699999999,"ZONA PAGA V268"]
[1,"Activa","ZP",13,"RM-0067","PC876","-","E-17-12-SN-30","-","LAS CONDES","Parada 5 / (M) Escuela   Militar","U6","-","-","-","-","-","06:30:00","15:30:00","-","-","-","-","-","-","-","-","-","-","C11I","C15I","C20I",null,null,null,null,null,null,null,null,null,null,null,null,null,null,null,null,null,null,3,5,"2007-03-19",352693.84,6301656.2999999998,"ZONA PAGA V268"]
[1,"Eliminada","ZP",14,"RM-0073","PJ1587","-","L-9-29-5-PO","-","LO PRADO","Parada 4 / (M) San Pablo","U5","-","-","-","-","-","06:30:00","22:00:00","-","-","-","-","-","-","-","-","-","-","J18R","J18cR",null,null,null,null,null,null,null,null,null,null,null,null,null,null,null,null,null,null,null,null,3,"2007-03-19",339895.55,6297981.7199999997,"ZONA PAGA V268"]
[1,"Activa","ZP COMPARTIDA",15,"RM-0082","PJ18","-","E-9-52-NS-20","-","LO PRADO","Parada 11 / (M) Las Rejas","U4","U7","U3","-","-","-","06:30:00","11:00:00","16:00:00","20:30:00","-","-","-","-","-","-","-","-","101I","102I","107I","481I","I14R",null,null,null,null,null,null,null,null,null,null,null,null,null,null,null,null,2,3,"2007-03-19",341476.72,6296769.4800000004,"ZONA PAGA V268"]
[1,"Eliminada","ZP",16,"RM-0087","PI67","-","E-7-51-NS-15","-","ESTACIÓN CENTRAL","Parada 7 / (M) San   Alberto Hurtado","U1","-","-","-","-","-","16:30:00","22:00:00","-","-","-","-","-","-","-","-","-","-","105I","120I",null,null,null,null,null,null,null,null,null,null,null,null,null,null,null,null,null,null,null,null,"-","2007-03-19",342804.63,6297184.5300000003,"ZONA PAGA V268"]
[1,"Activa","ZP COMPARTIDA",17,"RM-0103","PA87","-","E-20-291-PO-10","-","SANTIAGO","Parada 7 / Estación Mapocho","U2","U3","-","-","-","-","06:30:00","22:00:00","-","-","07:00:00","16:00:00","-","-","-","-","-","-","201R","214I","308R",null,null,null,null,null,null,null,null,null,null,null,null,null,null,null,null,null,null,4,4,"2007-03-19",346390.48,6299487.7000000002,"ZONA PAGA V268"]
[1,"Eliminada","ZP",18,"RM-0077","PJ96","-","L-9-7-63-PO","-","LO PRADO","Parada 5 / (M) Pajaritos","U5","-","-","-","-","-","17:00:00","20:30:00","-","-","07:00:00","21:00:00","-","-","-","-","-","-","510I","516I","J06R","J11R","J12I","J17I",null,null,null,null,null,null,null,null,null,null,null,null,null,null,null,null,2,"2007-03-19",340430.44,6296729.9900000002,"ZONA PAGA V268"]
[1,"Eliminada","ZP",19,"RM-0095","PA109","-","E-20-205-SN-60","-","SANTIAGO","Parada 8 / (M) Santa Lucía","U2","-","-","-","-","-","17:30:00","21:00:00","-","-","06.00","17.00","-","-","-","-","-","-","203R","208R","203eR",null,null,null,null,null,null,null,null,null,null,null,null,null,null,null,null,null,null,null,2,"2007-03-19",347000.49,6298345.4299999997,"ZONA PAGA V268"]
[1,"Activa","ZP",20,"RM-0099","PA138","-","E-20-205-SN-55","-","SANTIAGO","Parada 7 / (M) Santa Lucía","U2","-","-","-","-","-","16:00:00","20:30:00","-","-","06:00:00","17:00:00","-","-","-","-","-","-","205I","209I",null,null,null,null,null,null,null,null,null,null,null,null,null,null,null,null,null,null,null,4,3,"2007-03-19",347019.32,6298319.1100000003,"ZONA PAGA V268"]
[1,"Activa","ZP COMPARTIDA",21,"RM-0109","PD451","-","E-18-157-OP-5","-","ÑUÑOA","Parada 5 / (M) Plaza Egaña","U4","U2","U5","-","-","-","06:30:00","11:00:00","-","-","07:30:00","12:00:00","-","-","-","-","-","-","403R","422R","227I","D03R","D09I",null,null,null,null,null,null,null,null,null,null,null,null,null,null,null,null,2,3,"2007-03-19",353951.48,6297341.6900000004,"ZONA PAGA V268"]
[1,"Activa","ZP",22,"RM-0119","PC618","-","E-14-170-SN-10","-","PROVIDENCIA","Parada 1 / (M) Francisco Bilbao","U6","-","-","-","-","-","06:00:00","15:00:00","-","-","-","-","-","-","-","-","-","-","C01I","C05R","C07R",null,null,null,null,null,null,null,null,null,null,null,null,null,null,null,null,null,null,2,4,"2007-03-26",352636.54,6299789.4800000004,"ZONA PAGA V268"]
[1,"Eliminada","ZP",23,"RM-0127","PJ149","-","E-9-71-OP-33","-","LO PRADO","Parada 7 / (M) San Pablo","U4","-","-","-","-","-","17:30:00","21:00:00","-","-","07:30:00","12:00:00","-","-","-","-","-","-","402R","406R","407R","422R","426R",null,null,null,null,null,null,null,null,null,null,null,null,null,null,null,null,null,2,"2007-04-03",339764.44,6298136.2300000004,"ZONA PAGA V268"]
[1,"Eliminada","ZP COMPARTIDA",26,"RM-0225","PI470","PI400","E-7-53-PO-15","E-7-53-PO-20","ESTACIÓN CENTRAL","Parada 4 / (M) Las Rejas - Parada 3 / (M) Las  Rejas","U4","U5","-","-","-","-","06:00:00","10:30:00","-","-","-","-","-","-","-","-","-","-","106I","401I","404I","405I","412I","418I","419I","421I","423I","424I",null,null,null,null,null,null,null,null,null,null,null,null,4,"2007-08-24",341400.3,6296663.8899999997,"ZONA PAGA V268"]
[1,"Eliminada","ZP",28,"RM-0235","PA340","-","E-20-53-PO-90","-","SANTIAGO","Parada 9 / (M) Santa Lucía","U4","-","-","-","-","-","06:30:00","11:00:00","-","-","-","-","-","-","-","-","-","-","401I","407I","412I","418I","421I",null,null,null,null,null,null,null,null,null,null,null,null,null,null,null,null,null,2,"2007-08-22",346955.88,6298376.3200000003,"ZONA PAGA V268"]
[1,"Eliminada","ZP COMPARTIDA",29,"RM-0242","PA344","-","E-20-53-OP-40","-","SANTIAGO","Parada 12 / (M) Santa Lucía","U4","U3","U5","-","-","-","16:30:00","20:30:00","-","-","-","-","-","-","-","-","-","-","106R","125I","401R","405R","419R","421R","423R","424R","481I",null,null,null,null,null,null,null,null,null,null,null,null,null,2,"2007-08-24",346891.96,6298402.6900000004,"ZONA PAGA V268"]
[1,"Eliminada","ZP",30,"RM-0245","PD453","-","E-18-157-OP-45","-","ÑUÑOA","Parada 2 / Irarrázaval   Macul","U4","-","-","-","-","-","06:30:00","10:30:00","-","-","-","-","-","-","-","-","-","-","403R","422R",null,null,null,null,null,null,null,null,null,null,null,null,null,null,null,null,null,null,null,null,4,"2017-12-01",351578.64,6297138.3799999999,"ZONA PAGA V268"]
[1,"Suspendida ","ZP COMPARTIDA",31,"RM-0251","PI419","PI222","E-13-54-NS-85","E-13-54-NS-80","MAIPÚ","Parada 10 y 11 / (M) Plaza   de Maipú","U5","U3","U7","-","-","-","06:00:00","21:00:00","-","-","-","-","-","-","-","-","-","-","111I","506R","506eR","546eR","110I","106R","401R","405R","413cR","431cR","481I"," 506vR",null,null,null,null,null,null,null,null,null,1,3,"2007-08-23",336767.86,6290784.7300000004,"ZONA PAGA V268"]
[1,"Eliminada","ZP",32,"RM-0255","PJ956","-","E-9-71-OP-32","-","LO PRADO","Parada 1 / (M) San Pablo","U5","-","-","-","-","-","06:30:00","22:00:00","-","-","-","-","-","-","-","-","-","-","J13I","J13cI",null,null,null,null,null,null,null,null,null,null,null,null,null,null,null,null,null,null,null,null,2,"2007-11-20",339866.56,6298148.6200000001,"ZONA PAGA V268"]
[1,"Eliminada","ZP",33,"RM-0260","PJ121","-","E-10-71-PO-52","-","PUDAHUEL","Parada 3 / San Pablo   La Estrella","U4","-","-","-","-","-","06:30:00","11:00:00","-","-","-","-","-","-","-","-","-","-","402I","406I","407I","422I","426I","422cI","486I",null,null,null,null,null,null,null,null,null,null,null,null,null,null,null,2,"2007-08-24",337048.2,6298092.6200000001,"ZONA PAGA V268"]
[1,"Eliminada","ZP",34,"RM-0265","PJ117","-","T-10-71-PO-25","-","PUDAHUEL","Parada 1 / Serrano   San Pablo","U4","-","-","-","-","-","06:30:00","10:30:00","-","-","-","-","-","-","-","-","-","-","402I","406I","407I","426I",null,null,null,null,null,null,null,null,null,null,null,null,null,null,null,null,null,null,4,"2017-12-01",335557.61,6298194.6900000004,"ZONA PAGA V268"]
[1,"Eliminada","ZP",35,"RM-0270","PJ124","-","E-10-71-PO-75","-","PUDAHUEL","Parada 4 / (M) Pudahuel","U4","-","-","-","-","-","06:00:00","10:30:00","16:00:00","20:30:00","-","-","-","-","-","-","-","-","402I","406I","407I","422I","426I","422cI","486I",null,null,null,null,null,null,null,null,null,null,null,null,null,null,null,4,"2007-08-24",338158.27,6298049.2699999996,"ZONA PAGA V268"]
[1,"Eliminada","ZP COMPARTIDA",36,"RM-0275","PC155","-","E-14-128-PO-35","-","PROVIDENCIA","Parada 1 / (M) Tobalaba","U4","U5","U6","U7","-","-","06:00:00","11:00:00","16:00:00","20:30:00","-","-","-","-","-","-","-","-","117R","401I","406I","407I","421I","426I","117cI","430I","429cR","C06I",null,null,null,null,null,null,null,null,null,null,null,null,3,"2007-08-22",350940.52,6301115.3300000001,"ZONA PAGA V268"]
[1,"Eliminada","ZP COMPARTIDA",38,"RM-0286","PF126","-","T-34-236-SN-4","-","PUENTE ALTO","Balmaceda esq. / 21 de Mayo","U2","U7","-","-","-","-","06:30:00","08:30:00","-","-","-","-","-","-","-","-","-","-","210R","213eR","221eI",null,null,null,null,null,null,null,null,null,null,null,null,null,null,null,null,null,null,null,1,"2007-08-24",353932.95,6279795.2000000002,"ZONA PAGA V268"]
[1,"Eliminada","ZP",40,"RM-0295","PB242","-","T-2-3-NS-4","-","CONCHALÍ","Parada 6 / Independencia   Vespucio","U2","-","-","-","-","-","06:00:00","10:00:00","17:30:00","20:30:00","-","-","-","-","-","-","-","-","201I","201eI",null,null,null,null,null,null,null,null,null,null,null,null,null,null,null,null,null,null,null,null,"-","2007-08-23",342809.34,6306823.6399999997,"ZONA PAGA V268"]
[1,"Eliminada","ZP",41,"RM-0300","PA91","-","E-20-199-NS-25","-","SANTIAGO","Parada 11 / (M) Santa Lucía","U2","-","-","-","-","-","15:00:00","20:30:00","-","-","-","-","-","-","-","-","-","-","203I","203eI","206I","207eI","208I","226I","230I","214R",null,null,null,null,null,null,null,null,null,null,null,null,null,null,3,"2007-08-22",346825.39,6298500.8799999999,"ZONA PAGA V268"]
[1,"Eliminada","ZP",43,"RM-0315","PA547","-","T-20-68-SN-23","-","SANTIAGO","Parada 3 / (M) Quinta Normal","U5","-","-","-","-","-","17:30:00","21:30:00","-","-","-","-","-","-","-","-","-","-","J01R","J02R","J05I","J16R",null,null,null,null,null,null,null,null,null,null,null,null,null,null,null,null,null,null,"-","2007-08-22",343858.5,6298610.71,"ZONA PAGA V268"]
[1,"Activa","ZP",44,"RM-0320","PJ1818","-","T-9-52-NS-21","-","LO PRADO","Avenida Las Rejas esq. / Alameda","U3","-","-","-","-","-","17:00:00","21:30:00","-","-","-","-","-","-","-","-","-","-","I03R","I10R","I03cR",null,null,null,null,null,null,null,null,null,null,null,null,null,null,null,null,null,null,3,3,"2007-08-23",341476.72,6296768.4800000004,"ZONA PAGA V268"]
[1,"Activa","ZP",45,"RM-0328","PI841","-","L-7-31-5-NS","-","ESTACIÓN CENTRAL","Parada 9 / (M) San   Alberto Hurtado","U3","-","-","-","-","-","17:00:00","21:30:00","-","-","-","-","-","-","-","-","-","-","I16R","I17R","I03R",null,null,null,null,null,null,null,null,null,null,null,null,null,null,null,null,null,null,2,2,"2007-08-24",342703.58,6297137.2000000002,"ZONA PAGA V268"]
[1,"Activa","ZP COMPARTIDA",47,"RM-0335","PB44","-","E-4-9-PO-25","-","RECOLETA","Parada 3 / (M) Dorsal","U4","U7","-","-","-","-","06:30:00","11:00:00","16:00:00","20.-30","-","-","-","-","-","-","-","-","101R","107R","107cR",null,null,null,null,null,null,null,null,null,null,null,null,null,null,null,null,null,null,3,3,"2007-08-24",347157.73,6303505.8899999997,"ZONA PAGA V268"]
[1,"Eliminada","ZP COMPARTIDA",48,"RM-0340","PD107","-","E-18-159-NS-5","-","ÑUÑOA","Parada 3 / Irarrázaval   Macul","U1","U2","-","-","-","-","17:00:00","21:00:00","-","-","-","-","-","-","-","-","-","-","104I","212I","224I",null,null,null,null,null,null,null,null,null,null,null,null,null,null,null,null,null,null,null,4,"2017-12-01",351474.58,6297091.5199999996,"ZONA PAGA V268"]
[1,"Eliminada","ZP COMPARTIDA",49,"RM-0345","PI46","-","E-7-52-SN-30","-","ESTACIÓN CENTRAL","Parada 1 / (M) Las Rejas","U4","U3","-","-","-","-","06:30:00","11:00:00","16:00:00","20:30:00","-","-","-","-","-","-","-","-","101R","107R","I10I",null,null,null,null,null,null,null,null,null,null,null,null,null,null,null,null,null,null,null,3,"2007-08-23",341499.35,6296667.6200000001,"ZONA PAGA V268"]
[1,"Eliminada","ZP",51,"RM-0356","PD5","-","E-31-89-OP-40","-","MACUL","Parada 3 / (M) Pedrero","U1","-","-","-","-","-","17:00:00","21:30:00","-","-","-","-","-","-","-","-","-","-","102R","103I","107R","108R","117I",null,null,null,null,null,null,null,null,null,null,null,null,null,null,null,null,null,"-","2007-08-22",350264.77,6291205,"ZONA PAGA V268"]
[1,"Eliminada","ZP",52,"RM-0361","PF512","-","E-34-294-PO-5","-","PUENTE ALTO","Parada 2 / (M) Plaza de   Puente Alto","U7","-","-","-","-","-","17:30:00","21:00:00","-","-","-","-","-","-","-","-","-","-","F12R","F12cR","F14R","F18R","F13cI",null,null,null,null,null,null,null,null,null,null,null,null,null,null,null,null,null,3,"2007-08-23",353937.33,6280067.8499999996,"ZONA PAGA V268"]
[1,"Eliminada","ZP",53,"RM-0428","PD524","-","E-18-156-PO-5","-","ÑUÑOA","Parada 3 / (M) Irarrázaval","U5","-","-","-","-","-","17:00:00","21:00:00","-","-","-","-","-","-","-","-","-","-","506I","506eI","507I","507cI","510I","506vI",null,null,null,null,null,null,null,null,null,null,null,null,null,null,null,null,"-","2007-10-29",348617.96,6297033.2999999998,"ZONA PAGA V268"]
[1,"Activa","ZP COMPARTIDA",54,"RM-0385","PB724","-","E-4-296-PO-5","-","RECOLETA","Parada 4 / (M) Zapadores","U6","U7","-","-","-","-","06:30:00","21:30:00","-","-","-","-","-","-","-","-","-","-","B01R","B06I","B12I","B19I","712I",null,null,null,null,null,null,null,null,null,null,null,null,null,null,null,null,3,4,"2007-10-29",347212.36,6304169.3300000001,"ZONA PAGA V268"]
[1,"Suspendida ","ZP",55,"RM-0390","PC475","-","E-14-116-PO-60","-","PROVIDENCIA","Parada 3 / (M) Francisco Bilbao","U5","-","-","-","-","-","06:30:00","22:00:00","-","-","06:30:00","21:00:00","-","-","-","-","-","-","501I","504I","518I",null,null,null,null,null,null,null,null,null,null,null,null,null,null,null,null,null,null,3,3,"2007-10-29",352657.16,6299693.96,"ZONA PAGA V268"]
[1,"Eliminada","ZP",56,"RM-0393","PA435","-","E-20-189-PO-5","-","SANTIAGO","Parada 4 / (M) Parque   O'Higgins","U5","-","-","-","-","-","06:30:00","10:00:00","17:00:00","20:00:00","-","-","-","-","-","-","-","-","506I","506eI","507I","507cI","510I","506vI",null,null,null,null,null,null,null,null,null,null,null,null,null,null,null,null,"-","2007-10-29",346025.17,6296416.5199999996,"ZONA PAGA V268"]
[1,"Eliminada","ZP",57,"RM-0396","PD558","PD559","T-18-156-OP-38","T-18-156-OP-40","ÑUÑOA","Parada 4 / Pedagógico","U5","-","-","-","-","-","16:00:00","21:30:00","-","-","-","-","-","-","-","-","-","-","506R","506eR","507R","507cR","508R","510R","511R","506vR","516R","519eR",null,null,null,null,null,null,null,null,null,null,null,null,3,"2007-10-29",351574.8,6296069.79,"ZONA PAGA V268"]
[1,"Eliminada","ZP",58,"RM-0399","PD381","-","T-32-316-OP-30","-","PEÑALOLÉN","Parada 4 / (M) Los   Presidentes","U4","-","-","-","-","-","17:03:00","20:30:00","-","-","-","-","-","-","-","-","-","-","420eR","425R","429R",null,null,null,null,null,null,null,null,null,null,null,null,null,null,null,null,null,null,null,"-","2007-10-29",353356.59,6294384.4500000002,"ZONA PAGA V268"]
[1,"Eliminada","ZP",59,"RM-0402","PC3","-","T-14-127-NS-4","-","PROVIDENCIA","Parada 9 / (M) Pedro de Valdivia","U4","-","-","-","-","-","06:30:00","20:30:00","-","-","-","-","-","-","-","-","-","-","103I","117I",null,null,null,null,null,null,null,null,null,null,null,null,null,null,null,null,null,null,null,null,4,"2007-10-29",350150.29,6300397.2000000002,"ZONA PAGA V268"]
[1,"Eliminada","ZP COMPARTIDA",60,"RM-0405","PC38","-","T-14-125-NS-5","-","PROVIDENCIA","Parada 5 / (M) Manuel Montt","U3","U4","-","-","-","-","16:30:00","20:30:00","-","-","-","-","-","-","-","-","-","-","106I","126I",null,null,null,null,null,null,null,null,null,null,null,null,null,null,null,null,null,null,null,null,3,"2007-10-29",349473.96,6299795.2000000002,"ZONA PAGA V268"]
[1,"Eliminada","ZP",61,"RM-0408","PG95","-","E-24-205-NS-65","-","SAN RAMÓN","Parada 5 / (M) Santa Rosa","U2","-","-","-","-","-","17:00:00","22:00:00","-","-","-","-","-","-","-","-","-","-","206I","212I","216R","G01I",null,null,null,null,null,null,null,null,null,null,null,null,null,null,null,null,null,null,5,"2007-10-29",348279.37,6287319.6600000001,"ZONA PAGA V268"]
[1,"Eliminada","ZP",62,"RM-0411","PD210","-","E-31-12-SN-10","-","MACUL","Parada 7 / (M) Macul","U2","-","-","-","-","-","17:30:00","20:30:00","-","-","-","-","-","-","-","-","-","-","211I","211eI",null,null,null,null,null,null,null,null,null,null,null,null,null,null,null,null,null,null,null,null,"-","2007-10-29",352359.67,6291132.4000000004,"ZONA PAGA V268"]
[1,"Eliminada","ZP",63,"RM-0415","PB303","-","E-4-19-NS-20","-","RECOLETA","Parada 3 / (M) Zapadores","U2","-","-","-","-","-","06:30:00","09:30:00","-","-","-","-","-","-","-","-","-","-","203I","208I","208cI",null,null,null,null,null,null,null,null,null,null,null,null,null,null,null,null,null,null,null,"-","2007-10-29",347234.15,6304104.2999999998,"ZONA PAGA V268"]
[1,"Eliminada","ZP",64,"RM-0418","PJ884","-","L-9-3-27-OP","-","LO PRADO","Parada 6 / (M) Neptuno","U5","-","-","-","-","-","18:00:00","21:00:00","-","-","-","-","-","-","-","-","-","-","514R","J10R","J19R",null,null,null,null,null,null,null,null,null,null,null,null,null,null,null,null,null,null,null,"-","2007-10-29",339945.54,6297310.6100000003,"ZONA PAGA V268"]
[1,"Eliminada","ZP",65,"RM-0421","PA273","-","T-20-178-NS-20","-","SANTIAGO","Avenida Brasil esq. / Alameda","-","-","-","-","-","-","-","-","-","-","-","-","-","-","-","-","-","-",null,null,null,null,null,null,null,null,null,null,null,null,null,null,null,null,null,null,null,null,null,null,"-","2007-10-29",345270.03,6297960.1100000003,"ZONA PAGA V268"]
[1,"Activa","ZP",66,"RM-0425","PJ538","-","E-9-53-OP-5","-","LO PRADO","Parada 10 / (M) Las Rejas","U3","-","-","-","-","-","16:00:00","21:30:00","-","-","-","-","-","-","-","-","-","-","I08R",null,null,null,null,null,null,null,null,null,null,null,null,null,null,null,null,null,null,null,null,3,2,"2007-10-29",341465.2,6296737.6100000003,"ZONA PAGA V268"]
[1,"Eliminada","ZP",67,"RM-0380","PD564","-","E-18-156-OP-70","-","ÑUÑOA","Parada 2 / (M) Irarrázaval","U5","-","-","-","-","-","17:30:00","20:30:00","-","-","-","-","-","-","-","-","-","-","506R","507R","510R","506eR","507cR","506vR","516R","519eR",null,null,null,null,null,null,null,null,null,null,null,null,null,null,"-","2007-10-29",348682.44,6297083.3300000001,"ZONA PAGA V268"]
[1,"Eliminada","ZP",68,"RM-0433","PA156","-","E-20-190-SN-5","-","SANTIAGO","Parada 1 / (M) Santa Lucía","U2","-","-","-","-","-","17:30:00","20:30:00","-","-","-","-","-","-","-","-","-","-","206R","206eR","207eR","230R","226R","203eR","214I",null,null,null,null,null,null,null,null,null,null,null,null,null,null,null,"-","2007-10-29",346972.42,6298497.4900000002,"ZONA PAGA V268"]
[1,"Eliminada","ZP",69,"RM-0437","PG342","-","T-26-228-NS-38","-","LA CISTERNA","Parada 12 / (M) La Cisterna","U3","-","-","-","-","-","18:00:00","21:00:00","-","-","-","-","-","-","-","-","-","-","301I","301eI",null,null,null,null,null,null,null,null,null,null,null,null,null,null,null,null,null,null,null,null,"-","2007-10-29",345463.63,6287953.2300000004,"ZONA PAGA V268"]
[1,"Eliminada","ZP",70,"RM-0453","PB504","-","T-2-7-PO-7","-","CONCHALÍ","Parada 4 / Independencia   Vespucio","U4","-","-","-","-","-","06:30:00","10:30:00","-","-","-","-","-","-","-","-","-","-","425I","429I","429cI",null,null,null,null,null,null,null,null,null,null,null,null,null,null,null,null,null,null,null,4,"2017-12-01",342791.43,6306805.3899999997,"ZONA PAGA V268"]
[1,"Eliminada",null,71,"RM-0446","PB1000","-","T-2-7-PO-6","-","CONCHALÍ","Parada 5 / Independencia   Vespucio","-","-","-","-","-","-","-","-","-","-","-","-","-","-","-","-","-","-",null,null,null,null,null,null,null,null,null,null,null,null,null,null,null,null,null,null,null,null,null,null,"-","2007-10-29",342741.14,6306818.7699999996,"ZONA PAGA V268"]
[1,"Activa","ZP COMPARTIDA",72,"RM-0441","PE524","-","T-33-134-NS-27","-","LA FLORIDA","Parada 3 / (M) Vicente Valdés","U3","U7","-","-","-","-","06:30:00","21:30:00","-","-","-","-","-","-","-","-","-","-","E07I","E08R","E13R","E14R","E15cR","323I","325R","F25R","E10R",null,null,null,null,null,null,null,null,null,null,null,null,3,3,"2007-10-29",351697.57,6289214.4199999999,"ZONA PAGA V268"]
[1,"Activa","ZP",73,"RM-0450","PJ539","-","E-9-53-OP-6","-","LO PRADO","Parada 9 / (M) Las Rejas","U3","-","-","-","-","-","16:00:00","21:30:00","-","-","-","-","-","-","-","-","-","-","I09R","I09cR","I09eR",null,null,null,null,null,null,null,null,null,null,null,null,null,null,null,null,null,null,3,2,"2007-10-29",341448.16,6296733.2199999997,"ZONA PAGA V268"]
[1,"Eliminada","ZP COMPARTIDA",74,"RM-0458","PA345","-","T-20-53-OP-50","-","SANTIAGO","Parada 4 / (M) Universidad   de Chile","U4","U3","-","-","-","-","16:00:00","20:30:00","-","-","-","-","-","-","-","-","-","-","106R","125I","401R","404R","405R","419R","421R","423R","I09R","I09eR","481I",null,null,null,null,null,null,null,null,null,null,null,3,"2007-12-03",346664.27,6298338.3700000001,"ZONA PAGA V268"]
[1,"Eliminada","ZP",75,"RM-0471","PF272","-","T-34-270-SN-45","-","PUENTE ALTO","Parada 2 / (M) Hospital   Sótero del Río","U7","-","-","-","-","-","16:00:00","23:00:00","-","-","-","-","-","-","-","-","-","-","F05I","F06I","F08I","F14I","F20I","F23I","F27I",null,null,null,null,null,null,null,null,null,null,null,null,null,null,null,3,"2007-12-03",353177.99,6283634.7000000002,"ZONA PAGA V268"]
[1,"Eliminada","ZP COMPARTIDA",78,"RM-0502","PB198","-","T-2-3-NS-70","-","CONCHALÍ","Av. Independencia esq. / Avenida Dorsal","U2","U3","-","-","-","-","06:30:00","08:30:00","-","-","-","-","-","-","-","-","-","-","201I","201eI","202cI","223I","308I","230I",null,null,null,null,null,null,null,null,null,null,null,null,null,null,null,null,2,"2007-12-03",344682.34,6303384.9000000004,"ZONA PAGA V268"]
[1,"Eliminada","ZP",79,"RM-0543","PA652","-","T-20-188-NS-23","-","SANTIAGO","Parada 10 / (M) Los Héroes","U2","-","-","-","-","-","17:00:00","21:30:00","-","-","-","-","-","-","-","-","-","-","201eI",null,null,null,null,null,null,null,null,null,null,null,null,null,null,null,null,null,null,null,null,null,2,"2007-12-07",345626.8,6298090.9900000002,"ZONA PAGA V268"]
[1,"Eliminada","ZP",80,"RM-0461","PA378","-","E-20-68-SN-5","-","SANTIAGO","Parada 1 / (M) Estación Central","U4","-","-","-","-","-","17:30:00","20:30:00","-","-","-","-","-","-","-","-","-","-","406R","422R","426R",null,null,null,null,null,null,null,null,null,null,null,null,null,null,null,null,null,null,null,"-","2007-12-03",343953.86,6297545.1200000001,"ZONA PAGA V268"]
[1,"Eliminada","ZP",82,"RM-0545","PD535","-","E-18-156-PO-80","-","ÑUÑOA","Parada 5 / (M) Grecia","U5","-","-","-","-","-","16:30:00","21:30:00","-","-","-","-","-","-","-","-","-","-","506I","507I","510I","511I","506eI","507cI","506vI","516I","519eI",null,null,null,null,null,null,null,null,null,null,null,null,null,"-","2007-12-03",353516.89,6295579.6200000001,"ZONA PAGA V268"]
[1,"Activa","ZP",83,"RM-0548","PC349","-","T-14-128-OP-35","-","PROVIDENCIA","Parada 6 / (M) Pedro   de Valdivia","U6","-","-","-","-","-","-","-","12:00:00","21:00:00","-","-","-","-","-","-","-","-","410R",null,null,null,null,null,null,null,null,null,null,null,null,null,null,null,null,null,null,null,null,3,3,"2007-12-07",349980.76,6300491.9500000002,"ZONA PAGA V268"]
[1,"Eliminada",null,85,"RM-0508","PG8","-","T-26-228-NS-40","-","LA CISTERNA","Parada 9 / (M) La Cisterna","-","-","-","-","-","-","-","-","-","-","-","-","-","-","-","-","-","-",null,null,null,null,null,null,null,null,null,null,null,null,null,null,null,null,null,null,null,null,null,null,"-","2007-12-03",345442.46,6287842.2999999998,"ZONA PAGA V268"]
[1,"Eliminada","ZP COMPARTIDA",86,"RM-0497","PD1116","-","L-19-21-5-SN","-","LA REINA","Parada 2 / (M) Príncipe   de Gales","-","-","-","-","-","-","-","-","-","-","-","-","-","-","-","-","-","-",null,null,null,null,null,null,null,null,null,null,null,null,null,null,null,null,null,null,null,null,null,null,"-","2007-12-03",353799.61,6298819.3799999999,"ZONA PAGA V268"]
[1,"Activa","ZP",87,"RM-0550","PI911","-","T-7-51-NS-18","-","ESTACIÓN CENTRAL","Parada 8 / (M) San   Alberto Hurtado","U3","-","-","-","-","-","17:00:00","21:30:00","-","-","-","-","-","-","-","-","-","-","I04R","I13R","I14R","385R",null,null,null,null,null,null,null,null,null,null,null,null,null,null,null,null,null,3,4,"2008-01-14",342843.58,6297041.6500000004,"ZONA PAGA V268"]
[1,"Activa","ZP COMPARTIDA",90,"RM-0464","PA354","-","E-20-290-OP-10","-","SANTIAGO","Parada 5 / Estación Mapocho","U4","U3","-","-","-","-","06:30:00","11:00:00","16:00:00","20:30:00","-","-","-","-","-","-","-","-","119I","121I","409I",null,null,null,null,null,null,null,null,null,null,null,null,null,null,null,null,null,null,3,3,"2017-12-01",346607.38,6299503.6799999997,"ZONA PAGA V268"]
[1,"Activa","ZP",91,"RM-0556","PC203","-","T-14-110-PO-30","-","PROVIDENCIA","Parada 3 / (M) Pedro   de Valdivia","U4","-","-","-","-","-","06:30:00","11:00:00","-","-","-","-","-","-","-","-","-","-","411I",null,null,null,null,null,null,null,null,null,null,null,null,null,null,null,null,null,null,null,null,3,3,"2007-12-10",349947.06,6300361.3700000001,"ZONA PAGA V268"]
[1,"Eliminada","ZP",93,"RM-0561","PB865","-","L-1-1-5-OP","-","INDEPENDENCIA","Artesanos esq. / Av. Independencia","U6","-","-","-","-","-","18:00:00","21:00:00","-","-","-","-","-","-","-","-","-","-","B04R","B20R",null,null,null,null,null,null,null,null,null,null,null,null,null,null,null,null,null,null,null,null,"-","2007-12-07",346351.71,6299727.5499999998,"ZONA PAGA V268"]
[1,"Suspendida ","ZP",94,"RM-0563","PA232","-","E-20-188-NS-25","-","SANTIAGO","Parada 6 / (M) Los Héroes","U3","-","-","-","-","-","16:00:00","21:30:00","-","-","-","-","-","-","-","-","-","-","302I","302eI","125I",null,null,null,null,null,null,null,null,null,null,null,null,null,null,null,null,null,null,3,2,"2007-12-07",345646.46,6297908.29,"ZONA PAGA V268"]
[1,"Eliminada","ZP",96,"RM-0566","PC190","-","T-14-128-OP-40","-","PROVIDENCIA","Parada 4 / (M) Pedro   de Valdivia","U4","-","-","-","-","-","16:30:00","20:30:00","-","-","-","-","-","-","-","-","-","-","406R","407R","412R","418R","426R","405cI",null,null,null,null,null,null,null,null,null,null,null,null,null,null,null,null,3,"2007-12-10",349887.18,6300385.3499999996,"ZONA PAGA V268"]
[1,"Eliminada","ZP",97,"RM-0511","PJ686","-","L-9-13-60-NS","-","LO PRADO","Parada 3 / (M) Neptuno","U5","-","-","-","-","-","17:30:00","21:30:00","-","-","-","-","-","-","-","-","-","-","J04I","J08R","J15cI",null,null,null,null,null,null,null,null,null,null,null,null,null,null,null,null,null,null,null,"-","2007-12-03",339845.82,6297447.5999999996,"ZONA PAGA V268"]
[1,"Eliminada","ZP COMPARTIDA",98,"RM-0514","PH34","-","E-25-89-OP-21","-","SAN MIGUEL","Parada 1 / (M) Departamental","U4","U3","U7","-","-","-","06:30:00","11:00:00","16:00:00","20:30:00","-","-","-","-","-","-","-","-","102R","107R","108R","H05cR",null,null,null,null,null,null,null,null,null,null,null,null,null,null,null,null,null,null,4,"2007-12-03",346361.76,6291656,"ZONA PAGA V268"]
[1,"Eliminada","ZP",99,"RM-0518","PH11","-","E-25-89-PO-16","-","SAN MIGUEL","Parada 4 / (M) Departamental","U1","-","-","-","-","-","07:00:00","10:00:00","-","-","-","-","-","-","-","-","-","-","102I","107I","108I",null,null,null,null,null,null,null,null,null,null,null,null,null,null,null,null,null,null,null,"-","2007-12-03",346209.35,6291674.75,"ZONA PAGA V268"]
[1,"Eliminada","ZP",101,"RM-0529","PI106","-","E-13-278-PO-15","-","MAIPÚ","Parada 8 / (M) Plaza   de Maipú","U1","-","-","-","-","-","06:30:00","09:30:00","-","-","-","-","-","-","-","-","-","-","108I","109R","118I",null,null,null,null,null,null,null,null,null,null,null,null,null,null,null,null,null,null,null,"-","2007-12-03",336883.69,6290714.9299999997,"ZONA PAGA V268"]
[1,"Activa","ZP",102,"RM-0532","PI228","-","E-13-278-OP-30","-","MAIPÚ","Parada 5 / (M) Plaza de Maipú","U3","-","-","-","-","-","06:30:00","21:30:00","-","-","-","-","-","-","-","-","-","-","348R","I01R","I04R","I04cR","I05R","I18R","I21R",null,null,null,null,null,null,null,null,null,null,null,null,null,null,3,4,"2007-12-03",337024.91,6290748.9400000004,"ZONA PAGA V268"]
[1,"Eliminada","ZP",105,"RM-0576","PG116","-","E-24-205-NS-55","-","SAN RAMÓN","Parada 8 / (M) Santa Rosa","U2","-","-","-","-","-","18:00:00","21:00:00","-","-","-","-","-","-","-","-","-","-","203I","203eI",null,null,null,null,null,null,null,null,null,null,null,null,null,null,null,null,null,null,null,null,"-","2007-12-11",348267.84,6287444.2599999998,"ZONA PAGA V268"]
[1,"Eliminada","ZP",106,"RM-0523","PJ79","-","T-10-78-PO-15","-","PUDAHUEL","Parada 1 / Oceanía   Laguna Sur","U1","-","-","-","-","-","06:30:00","09:30:00","-","-","-","-","-","-","-","-","-","-","110R","111R","110cR",null,null,null,null,null,null,null,null,null,null,null,null,null,null,null,null,null,null,null,"-","2007-12-03",336769.63,6296402.3700000001,"ZONA PAGA V268"]
[1,"Activa","ZP COMPARTIDA",108,"RM-0481","PD85","-","E-32-254-SN-5","-","PEÑALOLÉN","Parada 2 / (M) Macul","U7","U3",null,"-","-","-","06:30:00","11:00:00","-","-","-","-","-","-","-","-","-","-","104R","106R","114R","126R","712I",null,null,null,null,null,null,null,null,null,null,null,null,null,null,null,null,3,3,"2007-12-03",352405.75,6291163.4900000002,"ZONA PAGA V268"]
[1,"Eliminada",null,109,"RM-0499","PC978","-","E-14-170-SN-5","-","PROVIDENCIA","Parada 2 / (M) Francisco Bilbao","-","-","-","-","-","-","-","-","-","-","-","-","-","-","-","-","-","-",null,null,null,null,null,null,null,null,null,null,null,null,null,null,null,null,null,null,null,null,null,null,"-","2007-12-03",352723.35,6299660.21,"ZONA PAGA V268"]
[1,"Eliminada","ZP COMPARTIDA",110,"RM-0488","PD1444","-","T-31-89-OP-2","-","MACUL","Parada  / Estación de Buses   (M) Macul -Oriente","U1","U3","-","-","-","-","05:30:00","01:00:00","-","-","05:30:00","01:00:00","-","-","05:30:00","01:00:00","-","-","102R","107R","108R","E17R",null,null,null,null,null,null,null,null,null,null,null,null,null,null,null,null,null,null,4,"2013-11-12",352228.76,6291047.0700000003,"ZONA PAGA V268"]
[1,"Eliminada","ZP COMPARTIDA",111,"RM-0493","PE1410","-","T-33-89-PO-32","-","LA FLORIDA","Parada  / Estación de Buses   (M) Macul -Poniente","U1","U3","-","-","-","-","05:30:00","01:00:00","-","-","05:30:00","01:00:00","-","-","05:30:00","01:00:00","-","-","E17I","106I","107I","118I","126I",null,null,null,null,null,null,null,null,null,null,null,null,null,null,null,null,null,4,"2013-11-12",352377.62,6290952.6200000001,"ZONA PAGA V268"]
[1,"Activa","ZP ",112,"RM-0484","PD75","-","E-31-254-NS-60","-","MACUL","Parada 1 / (M) Macul","U7","-","-","-","-","-","16:30:00","20:30:00","-","-","-","-","-","-","-","-","-","-","104I","114I","712R",null,null,null,null,null,null,null,null,null,null,null,null,null,null,null,null,null,null,4,3,"2007-12-03",352331.58,6291231.4500000002,"ZONA PAGA V268"]
[1,"Eliminada","ZP",115,"RM-0491","PE351","-","L-33-65-5-OP","-","LA FLORIDA","Parada 4 / (M) Trinidad","U3","-","-","-","-","-","-","-","-","-","-","-","-","-","-","-","-","-","E02R","E12R",null,null,null,null,null,null,null,null,null,null,null,null,null,null,null,null,null,null,null,null,"-","2007-12-03",352636.11,6286935.8300000001,"ZONA PAGA V268"]
[1,"Eliminada","ZP COMPARTIDA",116,"RM-0553","PA393","-","E-20-192-OP-5","-","SANTIAGO","Parada 1 / Plaza Italia","U5","U6","-","-","-","-","13:30:00","21:00:00","-","-","-","-","-","-","-","-","-","-","504R","505R","508R","502cR","517R","B27R",null,null,null,null,null,null,null,null,null,null,null,null,null,null,null,null,2,"2007-12-10",347944.78,6299092.79,"ZONA PAGA V268"]
[1,"Eliminada","ZPF",117,"RM-0370","PE1282","-","I-33-134-SN-67","-","LA FLORIDA","Parada  / Est. Intermodal   de La Florida","U3","-","-","-","-","-","06:00:00","23:00:00","-","-","06:30:00","23:05:00","-","-","08:00:00","23:05:00","-","-","E07I","E13R","E14R","E05R","E06I","E17I","E18R","E15cR","E08R","322I","323I",null,null,null,null,null,null,null,null,null,null,null,"-","2007-10-10",351553.5,6290027.2999999998,"ZONA PAGA V268"]
[1,"Activa","ZPF",118,"RM-0378","PG1585","-","I-26-228-NS-3","-","LA CISTERNA","Parada  / Est. Intermodal   Lo Ovalle","U2","-","-","-","-","-","06:00:00","23:00:00","-","-","-","-","-","-","-","-","-","-","G12I","G18R",null,null,null,null,null,null,null,null,null,null,null,null,null,null,null,null,null,null,null,2,2,"2007-10-10",345927.99,6290128.9699999997,"ZONA PAGA V268"]
[1,"Activa","ZPF",119,"RM-0374","PG1585","-","I-26-228-NS-3","-","LA CISTERNA","Parada  / Est. Intermodal   Lo Ovalle","U3","-","-","-","-","-","06:00:00","21:30:00","-","-","07:30:00","23:00:00","-","-","08:00:00","23:00:00","-","-","H03I","H07R","H08R","I05R","348R","321I",null,null,null,null,null,null,null,null,null,null,null,null,null,null,null,4,2,"2007-10-10",345927.99,6290128.9699999997,"ZONA PAGA V268"]
[1,"Eliminada","ZP COMPARTIDA",120,"RM-0595","PF311","-","T-34-270-NS-10","-","PUENTE ALTO","Parada 3 / (M) Hospital   Sótero del Río","U7","U3","-","-","-","-","16:00:00","22:30:00","-","-","-","-","-","-","-","-","-","-","F05R","F06R","F08R","F14R","F20R","F23R","E16R","F27R",null,null,null,null,null,null,null,null,null,null,null,null,null,null,3,"2008-04-02",353125.41,6283612.2699999996,"ZONA PAGA V268"]
[1,"Eliminada","ZP",121,"RM-0598","PF460","-","T-34-270-NS-50","-","PUENTE ALTO","Parada 1 / (M) Las Mercedes","U7","-","-","-","-","-","17:00:00","22:30:00","-","-","-","-","-","-","-","-","-","-","F01I","F10R","F13R","F15R","F16I","F19R","F25R","F29R",null,null,null,null,null,null,null,null,null,null,null,null,null,null,3,"2008-04-02",353632.65,6280887.3099999996,"ZONA PAGA V268"]
[1,"Suspendida ","ZP",122,"RM-0601","PC488","-","E-14-116-OP-3","-","PROVIDENCIA","Parada 6 / (M) Francisco Bilbao","U5","-","-","-","-","-","06:30:00","22:00:00","-","-","06:30:00","21:00:00","-","-","-","-","-","-","501R","504R","518R",null,null,null,null,null,null,null,null,null,null,null,null,null,null,null,null,null,null,2,3,"2008-01-14",352612.27,6299692.5899999999,"ZONA PAGA V268"]
[1,"Eliminada","ZP",124,"RM-0677","PB1283","-","E-4-295-PO-5","-","RECOLETA","Parada 3 / (M) Einstein","U6","-","-","-","-","-","18:00:00","21:00:00","-","-","-","-","-","-","-","-","-","-","B14R","B21I",null,null,null,null,null,null,null,null,null,null,null,null,null,null,null,null,null,null,null,null,"-","2008-03-17",347158.38,6302519.1200000001,"ZONA PAGA V268"]
[1,"Eliminada","ZP",127,"RM-0633","PA190","-","T-20-188-NS-13","-","SANTIAGO","Parada 10 / (M) Santa Ana","U2","-","-","-","-","-","17:30:00","20:30:00","-","-","-","-","-","-","-","-","-","-","217eR",null,null,null,null,null,null,null,null,null,null,null,null,null,null,null,null,null,null,null,null,null,2,"2008-03-03",345660.74,6298923.2800000003,"ZONA PAGA V268"]
[1,"Activa","ZP",136,"RM-0679","PA244","-","T-20-188-SN-67","-","SANTIAGO","Parada 9 / (M) Santa Ana","U3","-","-","-","-","-","06:30:00","21:30:00","-","-","-","-","-","-","-","-","-","-","303eR",null,null,null,null,null,null,null,null,null,null,null,null,null,null,null,null,null,null,null,null,3,2,"2008-03-17",345742.93,6298877.5499999998,"ZONA PAGA V268"]
[1,"Eliminada","ZP",144,"RM-0699","PA417","-","T-20-182-PO-45","-","SANTIAGO","Parada 3 / (M) Plaza   de Armas","-","-","-","-","-","-","-","-","-","-","-","-","-","-","-","-","-","-",null,null,null,null,null,null,null,null,null,null,null,null,null,null,null,null,null,null,null,null,null,null,"-","2008-03-03",346495.25,6298870.2199999997,"ZONA PAGA V268"]
[1,"Eliminada",null,146,"RM-0703","PJ96","-","L-9-7-63-PO","-","LO PRADO","Parada 5 / (M) Pajaritos","-","-","-","-","-","-","-","-","-","-","-","-","-","-","-","-","-","-",null,null,null,null,null,null,null,null,null,null,null,null,null,null,null,null,null,null,null,null,null,null,"-","2008-03-03",340430.44,6296729.9900000002,"ZONA PAGA V268"]
[1,"Eliminada","ZP",147,"RM-0706","PF212","-","L-34-44-6-PO","-","PUENTE ALTO","Parada 5 / (M) Plaza de   Puente Alto","U7","-","-","-","-","-","17:30:00","20:30:00","-","-","-","-","-","-","-","-","-","-","F03R","F03cR","F10I","F13I","712I",null,null,null,null,null,null,null,null,null,null,null,null,null,null,null,null,null,4,"2008-04-02",353962.59,6280072.6900000004,"ZONA PAGA V268"]
[1,"Eliminada",null,148,"RM-0710","PJ194","-","T-11-64-PO-3","-","CERRO NAVIA","Parada 1 / A. Alessandri   José J. Pérez","-","-","-","-","-","-","-","-","-","-","-","-","-","-","-","-","-","-",null,null,null,null,null,null,null,null,null,null,null,null,null,null,null,null,null,null,null,null,null,null,"-","2008-03-03",338363.39,6299701.4100000001,"ZONA PAGA V268"]
[1,"Eliminada","ZP COMPARTIDA",149,"RM-0635","PF94","-","T-34-236-SN-5","-","PUENTE ALTO","Balmaceda esq. / 21 de Mayo","U2","U7","-","-","-","-","06:30:00","08:30:00","-","-","-","-","-","-","-","-","-","-","205R","205eR","F16R",null,null,null,null,null,null,null,null,null,null,null,null,null,null,null,null,null,null,null,2,"2008-03-03",353918.16,6279870.96,"ZONA PAGA V268"]
[1,"Eliminada","ZP COMPARTIDA",153,"RM-0659","PC376","-","T-15-135-OP-30","-","VITACURA","Avenida Vitacura esq. / Lo Gallo","U4","U5","-","-","-","-","17:30:00","19:30:00","-","-","-","-","-","-","-","-","-","-","546eR","435R",null,null,null,null,null,null,null,null,null,null,null,null,null,null,null,null,null,null,null,null,2,"2008-03-03",355441.78,6304975.4299999997,"ZONA PAGA V268"]
[1,"Eliminada","ZP",155,"RM-0663","PC378","-","T-17-140-OP-32","-","LAS CONDES","Parada 2 / (M) Manquehue","U4","-","-","-","-","-","17:30:00","20:30:00","-","-","-","-","-","-","-","-","-","-","417eR",null,null,null,null,null,null,null,null,null,null,null,null,null,null,null,null,null,null,null,null,null,"-","2008-03-03",354398.37,6302360.2699999996,"ZONA PAGA V268"]
[1,"Eliminada","ZP",157,"RM-0669","PA191","-","T-20-68-NS-6","-","SANTIAGO","Parada 4 / (M) Quinta Normal","U2","-","-","-","-","-","17:30:00","20:30:00","-","-","-","-","-","-","-","-","-","-","221eR","218eR",null,null,null,null,null,null,null,null,null,null,null,null,null,null,null,null,null,null,null,null,"-","2008-03-03",343839.82,6298549.4100000001,"ZONA PAGA V268"]
[1,"Eliminada","ZP",159,"RM-0675","PC114","-","T-17-12-NS-23","-","LAS CONDES","Parada 10 / (M) Escuela   Militar","U2","-","-","-","-","-","17:30:00","20:30:00","-","-","-","-","-","-","-","-","-","-","219eR",null,null,null,null,null,null,null,null,null,null,null,null,null,null,null,null,null,null,null,null,null,"-","2008-03-03",352639.88,6301652.9000000004,"ZONA PAGA V268"]
[1,"Eliminada",null,162,"RM-0712","PG1583","-","I-26-228-SN-25","-","LA CISTERNA","Parada  / Est. Intermodal   La Cisterna","U2","-","-","-","-","-","18:00:00","21:00:00","-","-","-","-","-","-","-","-","-","-","228I",null,null,null,null,null,null,null,null,null,null,null,null,null,null,null,null,null,null,null,null,null,"-","2008-07-07",345540.33,6287776.1799999997,"ZONA PAGA V268"]
[1,"Eliminada","ZP",164,"RM-0716","PE114","-","E-22-205-SN-33","-","LA GRANJA","Parada 4 / (M) Santa Rosa","U2","-","-","-","-","-","06:30:00","08:30:00","-","-","-","-","-","-","-","-","-","-","203R","203eR","206R","206cR","G01R","212R",null,null,null,null,null,null,null,null,null,null,null,null,null,null,null,null,3,"2009-01-12",348294.77,6287303.4400000004,"ZONA PAGA V268"]
[1,"Eliminada",null,165,"RM-0718","PG1583","-","I-26-228-SN-25","-","LA CISTERNA","Parada  / Est. Intermodal   La Cisterna","U2","-","-","-","-","-","17:00:00","22:00:00","-","-","-","-","-","-","-","-","-","-","G04I",null,null,null,null,null,null,null,null,null,null,null,null,null,null,null,null,null,null,null,null,null,"-","2009-01-26",345540.33,6287776.1799999997,"ZONA PAGA V268"]
[1,"Activa","VM",166,"RM-0726","PC617","-","E-17-140-OP-60","-","LAS CONDES","Parada 1 / (M) Escuela   Militar","U6","-","-","-","-","-","06:00:00","15:00:00","-","-","-","-","-","-","-","-","-","-","C14I",null,null,null,null,null,null,null,null,null,null,null,null,null,null,null,null,null,null,null,null,2,3,"2009-03-02",352930.74,6301811.2000000002,"ZONA PAGA V268"]
[1,"Eliminada","ZP",168,"RM-0147","PG1599","-","T-30-248-SN-28","-","SAN BERNARDO","Parada 2 / Plaza   de San Bernardo","U2","-","-","-","-","-","06:30:00","08:30:00","-","-","-","-","-","-","-","-","-","-","217eI",null,null,null,null,null,null,null,null,null,null,null,null,null,null,null,null,null,null,null,null,null,2,"2007-04-09",341911.17,6281752.54,"ZONA PAGA V268"]
[1,"Eliminada",null,170,"RM-0151","PG1583","-","I-26-228-SN-25","-","LA CISTERNA","Parada  / Est. Intermodal   La Cisterna","U2","-","-","-","-","-","06:00:00","09:30:00","-","-","-","-","-","-","-","-","-","-","219eI",null,null,null,null,null,null,null,null,null,null,null,null,null,null,null,null,null,null,null,null,null,"-","2007-04-09",345540.33,6287776.1799999997,"ZONA PAGA V268"]
[1,"Eliminada","ZP",172,"RM-0187","PC255","-","T-15-135-OP-55","-","VITACURA","Parada 4 / Los Cobres   de Vitacura","U4","-","-","-","-","-","17:30:00","20:30:00","-","-","-","-","-","-","-","-","-","-","416eR",null,null,null,null,null,null,null,null,null,null,null,null,null,null,null,null,null,null,null,null,null,"-","2007-04-17",354187.54,6304550.2599999998,"ZONA PAGA V268"]
[1,"Eliminada","ZP",173,"RM-0175","PC255","-","T-15-135-OP-55","-","VITACURA","Parada 4 / Los Cobres   de Vitacura","U4","-","-","-","-","-","17:30:00","20:30:00","-","-","-","-","-","-","-","-","-","-","414eR",null,null,null,null,null,null,null,null,null,null,null,null,null,null,null,null,null,null,null,null,null,"-","2007-04-13",354187.54,6304550.2599999998,"ZONA PAGA V268"]
[1,"Activa","VM",178,"RM-0730","PG1583","-","I-26-228-SN-25","-","LA CISTERNA","Parada  / Est. Intermodal   La Cisterna","U4","U5","-","-","-","-","06:00:00","10:30:00","-","-","-","-","-","-","-","-","-","-","428R","428eR","428cR",null,null,null,null,null,null,null,null,null,null,null,null,null,null,null,null,null,null,2,4,"2009-04-06",345540.33,6287776.1799999997,"ZONA PAGA V268"]
[1,"Eliminada",null,179,"RM-0732","PG1583","-","I-26-228-SN-25","-","LA CISTERNA","Parada  / Est. Intermodal   La Cisterna","U3","-","-","-","-","-","15:00:00","22:30:00","-","-","-","-","-","-","-","-","-","-","301cI",null,null,null,null,null,null,null,null,null,null,null,null,null,null,null,null,null,null,null,null,null,"-","2009-04-06",345540.33,6287776.1799999997,"ZONA PAGA V268"]
[1,"Eliminada","ZP",183,"RM-0736","PA396","-","E-20-290-OP-20","-","SANTIAGO","Parada 3 / Estación Mapocho","U5","-","-","-","-","-","17:30:00","21:00:00","-","-","-","-","-","-","-","-","-","-","502R","502cR","503R","509R","517R",null,null,null,null,null,null,null,null,null,null,null,null,null,null,null,null,null,"-","2009-08-24",346337.71,6299501.46,"ZONA PAGA V268"]
[1,"Activa","ZP COMPARTIDA",185,"RM-0741","PC1066","-","T-17-140-PO-29","-","LAS CONDES","Parada 4 / (M) Manquehue","U4","U6","U5","-","-","-","06:30:00","11:00:00","-","-","-","-","-","-","-","-","-","-","406I","426I","430I","406cI","C01I","C01cI",null,null,null,null,null,null,null,null,null,null,null,null,null,null,null,3,3,"2010-01-06",354055.16,6302211.5199999996,"ZONA PAGA V268"]
[1,"Activa","ZP COMPARTIDA",186,"RM-0744","PC1064","-","T-17-141-SN-2","-","LAS CONDES","Parada 1 / (M) Los Dominicos","U6","U7","-","-","-","-","06:30:00","15:30:00","-","-","-","-","-","-","-","-","-","-","421I","C02R","C02cR",null,null,null,null,null,null,null,null,null,null,null,null,null,null,null,null,null,null,3,4,"2010-01-06",356344.85,6302493.5599999996,"ZONA PAGA V268"]
[1,"Activa","ZP",187,"RM-0748","PE863","-","L-33-42-70-OP","-","LA FLORIDA","Parada 6 / (M) Los Quillayes","U3","-","-","-","-","-","06:30:00","21:30:00","-","-","-","-","-","-","-","-","-","-","E12I","E11I",null,null,null,null,null,null,null,null,null,null,null,null,null,null,null,null,null,null,null,2,2,"2010-02-01",352786.13,6285418.0499999998,"ZONA PAGA V268"]
[1,"Activa","ZP",188,"RM-0750","PE332","-","L-33-42-70-PO","-","LA FLORIDA","Parada 5 / (M) Los Quillayes","U3","-","-","-","-","-","06:30:00","21:30:00","-","-","-","-","-","-","-","-","-","-","E02I","E12I","E11R",null,null,null,null,null,null,null,null,null,null,null,null,null,null,null,null,null,null,3,2,"2010-02-01",352795.16,6285408.8899999997,"ZONA PAGA V268"]
[1,"Eliminada","ZP",189,"RM-0753","PA450","-","E-20-189-OP-40","-","SANTIAGO","Parada 1 / (M) Parque   O'Higgins","U5","-","-","-","-","-","06:30:00","09:30:00","17:00:00","20:00:00","-","-","-","-","-","-","-","-","506R","507R","510R","506eR","507cR","509R","506vR",null,null,null,null,null,null,null,null,null,null,null,null,null,null,null,"-","2010-02-01",346022.13,6296456.4100000001,"ZONA PAGA V268"]
[1,"Eliminada","ZP",190,"RM-0759","PJ1586","-","E-9-299-SN-5","-","LO PRADO","Parada 10 / (M) San Pablo","U5","-","-","-","-","-","17:00:00","21:00:00","-","-","-","-","-","-","-","-","-","-","J01I","J08I","511R",null,null,null,null,null,null,null,null,null,null,null,null,null,null,null,null,null,null,null,2,"2010-03-08",339858.91,6298054.54,"ZONA PAGA V268"]
[1,"Eliminada","ZP",191,"RM-0762","PA374","-","E-20-53-OP-45","-","SANTIAGO","Parada 10 / (M) Santa Lucía","U4","-","-","-","-","-","16:30:00","20:30:00","-","-","-","-","-","-","-","-","-","-","406R","407R","422R","426R",null,null,null,null,null,null,null,null,null,null,null,null,null,null,null,null,null,null,3,"2011-12-06",346790.32,6298376.4800000004,"ZONA PAGA V268"]
[1,"Eliminada","ZP COMPARTIDA",192,"RM-0763","PA215","-","E-20-53-PO-70","-","SANTIAGO","Parada 5 / (M) La Moneda","U4","U2","U3","U5","-","-","16:30:00","21:00:00","-","-","-","-","-","-","-","-","-","-","210I","210vI","229I","301I","301eI","385I","403I","422I","519eI","513I","516I",null,null,null,null,null,null,null,null,null,null,null,4,"2011-12-06",346225.95,6298139.6900000004,"ZONA PAGA V268"]
[1,"Activa","ZP COMPARTIDA",193,"RM-0765","PB69","-","E-5-30-PO-7","-","RENCA","Parada 4 / Plaza Renca","U6","U5","-","-","-","-","07:00:00","15:00:00","-","-","07:00:00","15:00:00","-","-","-","-","-","-","110R","408I","410I","B03I","B20I","B29I",null,null,null,null,null,null,null,null,null,null,null,null,null,null,null,4,4,"2012-01-02",341463.27,6302500.9000000004,"ZONA PAGA V268"]
[1,"Activa","ZP COMPARTIDA",194,"RM-0766","PC57","-","E-17-12-SN-35","-","LAS CONDES","Parada 8 / (M) Escuela   Militar","U4","U7","U6","U2","-","-","06:30:00","10:00:00","16:00:00","20:30:00","-","-","-","-","-","-","-","-","219eI","425R","C18I","712I",null,null,null,null,null,null,null,null,null,null,null,null,null,null,null,null,null,4,4,"2017-12-01",352673.28000000003,6301705.5700000003,"ZONA PAGA V268"]
[1,"Eliminada","ZPF",195,"RM-0764","PE1282","-","I-33-134-SN-67","-","LA FLORIDA","Parada  / Est. Intermodal   de La Florida","U3","-","-","-","-","-","06:00:00","23:00:00","-","-","07:00:00"," 21:00","-","-","08:00:00","23:05:00","-","-","E07I","E13R","E14R","E05R","E06I","E17I","E18R","E15cR","E08R","322I","323I",null,null,null,null,null,null,null,null,null,null,null,"-","2011-12-22",351553.5,6290027.2999999998,"ZONA PAGA V268"]
[1,"Eliminada",null,196,"RM-0767","PC503","-","T-14-116-OP-70","-","PROVIDENCIA","Parada 4 / (M) Parque   Bustamante","-","-","-","-","-","-","-","-","-","-","-","-","-","-","-","-","-","-",null,null,null,null,null,null,null,null,null,null,null,null,null,null,null,null,null,null,null,null,null,null,"-","2012-02-01",348203.88,6298402.1100000003,"ZONA PAGA V268"]
[1,"Eliminada",null,197,"RM-0768","PE575","-","L-33-134-60-SN","-","LA FLORIDA","Parada 4 / (M) Vicente   Valdés","-","-","-","-","-","-","-","-","-","-","-","-","-","-","-","-","-","-",null,null,null,null,null,null,null,null,null,null,null,null,null,null,null,null,null,null,null,null,null,null,"-","2012-02-01",351750.47,6289175.4199999999,"ZONA PAGA V268"]
[1,"Eliminada",null,198,"RM-0769","PB159","-","T-4-19-SN-4","-","RECOLETA","Parada 4 / Recoleta   Franciscana","-","-","-","-","-","-","-","-","-","-","-","-","-","-","-","-","-","-",null,null,null,null,null,null,null,null,null,null,null,null,null,null,null,null,null,null,null,null,null,null,"-","2012-02-01",346830.11,6299626.4400000004,"ZONA PAGA V268"]
[1,"Activa","VM",199,"RM-0770","PG1583","-","I-26-228-SN-25","-","LA CISTERNA","Parada  / Est. Intermodal   La Cisterna","U7","-","-","-","-","-","06:00:00","23:00:00","-","-","06:30:00","23:00:00","-","-","08:00:00","23:00:00","-","-","F05I",null,null,null,null,null,null,null,null,null,null,null,null,null,null,null,null,null,null,null,null,3,"-","2013-05-27",345540.33,6287776.1799999997,"ZONA PAGA V268"]
[null,"Activa","VM",200,"RM-0771","PG1583","-","I-26-228-SN-25","-","LA CISTERNA","Parada  / Est. Intermodal   La Cisterna","U7","-","-","-","-","-","06:00:00","23:00:00","-","-","06:30:00","23:00:00","-","-","08:00:00","23:00:00","-","-","F06I",null,null,null,null,null,null,null,null,null,null,null,null,null,null,null,null,null,null,null,null,3,"-","2013-05-27",345540.33,6287776.1799999997,"ZONA PAGA V268"]
[null,"Activa","VM",201,"RM-0772","PG1583","-","I-26-228-SN-25","-","LA CISTERNA","Parada  / Est. Intermodal   La Cisterna","U7","-","-","-","-","-","06:00:00","23:00:00","-","-","06:30:00","23:00:00","-","-","08:00:00","23:00:00","-","-","F20I",null,null,null,null,null,null,null,null,null,null,null,null,null,null,null,null,null,null,null,null,3,"-","2013-05-27",345540.33,6287776.1799999997,"ZONA PAGA V268"]
[1,"Activa","VM",202,"RM-0773","PG1583","-","I-26-228-SN-25","-","LA CISTERNA","Parada  / Est. Intermodal   La Cisterna","U2","-","-","-","-","-","06:00:00","23:59:00","-","-","06:30:00","23:00:00","-","-","10:00:00","23:59:59","-","-","G05R",null,null,null,null,null,null,null,null,null,null,null,null,null,null,null,null,null,null,null,null,2,"-","2015-01-15",345540.33,6287776.1799999997,"ZONA PAGA V268"]
[null,"Activa","VM",203,"RM-0774","PG1583","-","I-26-228-SN-25","-","LA CISTERNA","Parada  / Est. Intermodal   La Cisterna","U2","-","-","-","-","-","06:00:00","23:59:00","-","-","06:00:00","23:59:59","-","-","10:00:00","23:59:59","-","-","G22R",null,null,null,null,null,null,null,null,null,null,null,null,null,null,null,null,null,null,null,null,2,"-","2015-01-15",345540.33,6287776.1799999997,"ZONA PAGA V268"]
[null,"Activa","VM",208,"RM-0779","PG1583","-","I-26-228-SN-25","-","LA CISTERNA","Parada  / Est. Intermodal   La Cisterna","U2","-","-","-","-","-","06:00:00","23:59:00","-","-","06:00:00","23:59:59","-","-","10:00:00","23:00:00","-","-","G16I",null,null,null,null,null,null,null,null,null,null,null,null,null,null,null,null,null,null,null,null,2,"-","2015-01-15",345540.33,6287776.1799999997,"ZONA PAGA V268"]
[null,"Activa","VM",209,"RM-0780","PG1583","-","I-26-228-SN-25","-","LA CISTERNA","Parada  / Est. Intermodal   La Cisterna","U2","-","-","-","-","-","06:00:00","23:59:00","-","-","06:00:00","23:59:59","-","-","10:00:00","23:00:00","-","-","G08R","G08vR",null,null,null,null,null,null,null,null,null,null,null,null,null,null,null,null,null,null,null,2,"-","2015-01-15",345540.33,6287776.1799999997,"ZONA PAGA V268"]
[null,"Activa","VM",211,"RM-0782","PG1583","-","I-26-228-SN-25","-","LA CISTERNA","Parada  / Est. Intermodal   La Cisterna","U2","-","-","-","-","-","06:00:00","23:59:00","-","-","06:00:00","23:59:59","-","-","10:00:00","23:00:00","-","-","G13I",null,null,null,null,null,null,null,null,null,null,null,null,null,null,null,null,null,null,null,null,2,"-","2015-01-15",345540.33,6287776.1799999997,"ZONA PAGA V268"]
[null,"Activa","VM",212,"RM-0783","PG1583","-","I-26-228-SN-25","-","LA CISTERNA","Parada  / Est. Intermodal   La Cisterna","U2","-","-","-","-","-","06:00:00","23:59:00","-","-","06:00:00","23:59:59","-","-","10:00:00","23:00:00","-","-","G15I",null,null,null,null,null,null,null,null,null,null,null,null,null,null,null,null,null,null,null,null,2,"-","2015-01-15",345540.33,6287776.1799999997,"ZONA PAGA V268"]
[null,"Activa","VM",213,"RM-0784","PG1583","-","I-26-228-SN-25","-","LA CISTERNA","Parada  / Est. Intermodal   La Cisterna","U2","-","-","-","-","-","06:00:00","23:59:00","-","-","-","-","-","-","-","-","-","-","211cI",null,null,null,null,null,null,null,null,null,null,null,null,null,null,null,null,null,null,null,null,2,"-","2015-01-15",345540.33,6287776.1799999997,"ZONA PAGA V268"]
[null,"Activa","VM",241,"RM-0812","PG1583","-","I-26-228-SN-25","-","LA CISTERNA","Parada  / Est. Intermodal   La Cisterna","U2","-","-","-","-","-","06:00:00","00:00:00","-","-","06:30:00","23:00:00","-","-","10:00:00","23:59:59","-","-","228I",null,null,null,null,null,null,null,null,null,null,null,null,null,null,null,null,null,null,null,null,2,"-","2015-02-02",345540.33,6287776.1799999997,"ZONA PAGA V268"]
[null,"Activa","VM",242,"RM-0813","PG1583","-","I-26-228-SN-25","-","LA CISTERNA","Parada  / Est. Intermodal   La Cisterna","U2","-","-","-","-","-","06:00:00","00:00:00","-","-","06:30:00","23:00:00","-","-","10:00:00","23:59:59","-","-","G04I",null,null,null,null,null,null,null,null,null,null,null,null,null,null,null,null,null,null,null,null,2,"-","2015-02-03",345540.33,6287776.1799999997,"ZONA PAGA V268"]
[null,"Activa","VM",266,"RM-0837","PG1583","-","I-26-228-SN-25","-","LA CISTERNA","Parada  / Est. Intermodal   La Cisterna","U2","-","-","-","-","-","17:00:00","22:00:00","-","-","-","-","-","-","-","-","-","-","228I",null,null,null,null,null,null,null,null,null,null,null,null,null,null,null,null,null,null,null,null,2,"-","2016-06-01",345540.33,6287776.1799999997,"ZONA PAGA V268"]
[null,"Activa","VM",267,"RM-0838","PG1583","-","I-26-228-SN-25","-","LA CISTERNA","Parada  / Est. Intermodal   La Cisterna","U2","-","-","-","-","-","17:00:00","21:00:00","-","-","-","-","-","-","-","-","-","-","G04I",null,null,null,null,null,null,null,null,null,null,null,null,null,null,null,null,null,null,null,null,1,"-","2016-06-01",345540.33,6287776.1799999997,"ZONA PAGA V268"]
[null,"Activa","VM",268,"RM-0839","PG1583","-","I-26-228-SN-25","-","LA CISTERNA","Parada  / Est. Intermodal   La Cisterna","U2","-","-","-","-","-","05:30:00","09:30:00","-","-","-","-","-","-","-","-","-","-","219eI",null,null,null,null,null,null,null,null,null,null,null,null,null,null,null,null,null,null,null,null,4,"-","2016-06-01",345540.33,6287776.1799999997,"ZONA PAGA V268"]
[1,"Eliminada","ZP",204,"RM-0776","PA371","-","E-20-53-PO-95","-","SANTIAGO","Parada 5 / (M) Santa Lucía","-","-","-","-","-","-","-","-","-","-","-","-","-","-","-","-","-","-",null,null,null,null,null,null,null,null,null,null,null,null,null,null,null,null,null,null,null,null,null,null,"-","-",347065.75,6298411.1200000001,"ZONA PAGA V268"]
[1,"Eliminada","ZP",205,"RM-0775","PA53","-","E-20-203-NS-35","-","SANTIAGO","Parada 1 / (M) La Moneda","-","-","-","-","-","-","-","-","-","-","-","-","-","-","-","-","-","-",null,null,null,null,null,null,null,null,null,null,null,null,null,null,null,null,null,null,null,null,null,null,"-","2013-10-28",345939.19,6298180.1799999997,"ZONA PAGA V268"]
[1,"Eliminada","ZP",206,"RM-0777","PA376","-","E-20-53-OP-75","-","SANTIAGO","Parada 2 / (M) La Moneda","-","-","-","-","-","-","-","-","-","-","-","-","-","-","-","-","-","-",null,null,null,null,null,null,null,null,null,null,null,null,null,null,null,null,null,null,null,null,null,null,"-","-",346024.39,6298161.8300000001,"ZONA PAGA V268"]
[1,"Eliminada","ZP",207,"RM-0778","PJ153","-","E-10-71-OP-4","-","PUDAHUEL","Parada 1 / (M) Pudahuel","-","-","-","-","-","-","-","-","-","-","-","-","-","-","-","-","-","-",null,null,null,null,null,null,null,null,null,null,null,null,null,null,null,null,null,null,null,null,null,null,"-","2014-01-13",338154.45,6298072.2800000003,"ZONA PAGA V268"]
[1,"Eliminada",null,210,"RM-0781","PG1583","-","I-26-228-SN-25","-","LA CISTERNA","Parada  / Est. Intermodal   La Cisterna","-","-","-","-","-","-","-","-","-","-","-","-","-","-","-","-","-","-",null,null,null,null,null,null,null,null,null,null,null,null,null,null,null,null,null,null,null,null,null,null,"-","2014-02-17",345540.33,6287776.1799999997,"ZONA PAGA V268"]
[1,"Activa","ZP",214,"RM-0785","PG1662","-","T-23-205-SN-82","-","LA PINTANA","Parada 2 / Santo Tomás   Santa Rosa","U2","-","-","-","-","-","05:30:00","10:30:00","-","-","06:00:00","11:00:00","-","-","-","-","-","-","205R","207R","209R","207eR","209cR","205cR","207cR",null,null,null,null,null,null,null,null,null,null,null,null,null,null,2,"-","2015-01-15",348645.93,6285432.4299999997,"ZONA PAGA V268"]
[1,"Activa","ZP",215,"RM-0786","PE187","-","E-22-205-SN-31","-","LA GRANJA","Parada 2 / (M) Santa Rosa","U2","-","-","-","-","-","06:00:00","17.00","-","-","06:00:00","11:00:00","-","-","-","-","-","-","216I",null,null,null,null,null,null,null,null,null,null,null,null,null,null,null,null,null,null,null,null,1,"-","2015-01-15",348318.21,6287212.5700000003,"ZONA PAGA V268"]
[1,"Activa","ZP",216,"RM-0787","PE65","-","E-22-205-SN-32","-","LA GRANJA","Parada 3 / (M) Santa Rosa","U2","-","-","-","-","-","05:30:00","10:30:00","-","-","06:00:00","11:00:00","-","-","-","-","-","-","205R","207R","209R","205cR","207cR","209cR","207eR",null,null,null,null,null,null,null,null,null,null,null,null,null,null,2,"-","2015-01-15",348299.33,6287249.54,"ZONA PAGA V268"]
[1,"Activa","ZP",217,"RM-0788","PC101","-","L-15-9-65-NS","-","VITACURA","Parada 3 / Clínica Alemana","U2","-","-","-","-","-","12:30:00","21:00:00","-","-","-","-","-","-","-","-","-","-","216R",null,null,null,null,null,null,null,null,null,null,null,null,null,null,null,null,null,null,null,null,1,"-","2015-01-15",353752.81,6304171.9299999997,"ZONA PAGA V268"]
[1,"Activa","ZP",218,"RM-0789","PG8","-","T-26-228-NS-40","-","LA CISTERNA","Parada 9 / (M) La Cisterna","U2","-","-","-","-","-","06:00:00","21:00:00","-","-","07:00:00","21.00","-","-","-","-","-","-","201I","223I","G18R","271I",null,null,null,null,null,null,null,null,null,null,null,null,null,null,null,null,null,3,"-","2015-01-15",345442.46,6287842.2999999998,"ZONA PAGA V268"]
[1,"Eliminada","ZPM",219,"RM-0790","PD590","-","T-18-156-PO-37","-","ÑUÑOA","Parada 1 / Pedagógico","U5","-","-","-","-","-","17:00:00","21:00:00","-","-","-","-","-","-","-","-","-","-","506I","506eI","506vI","507I","507cI","510I","516I","511I","519eI",null,null,null,null,null,null,null,null,null,null,null,null,null,"-","2014-12-02",351592.54,6296052.96,"ZONA PAGA V268"]
[1,"Activa","ZP COMPARTIDA",220,"RM-0792","PB82","-","E-5-30-OP-20","-","RENCA","Parada 1 / Plaza Renca","U6","U5","-","-","-","-","06:30:00","21:30:00","-","-","-","-","-","-","-","-","-","-","105R","120R","410R","B03R","B09R","B20R","B29R","109R","110I","408R","408eR",null,null,null,null,null,null,null,null,null,null,4,5,"2015-01-15",341446.31,6302547.96,"ZONA PAGA V268"]
[1,"Activa","ZP",221,"RM-0793","PB1269","-","E-4-295-OP-5","-","RECOLETA","Parada 4 / (M) Einstein","U6","-","-","-","-","-","06:30:00","21:30:00","-","-","-","-","-","-","-","-","-","-","B14I","B21R",null,null,null,null,null,null,null,null,null,null,null,null,null,null,null,null,null,null,null,2,2,"2015-01-15",347139.83,6302541.9400000004,"ZONA PAGA V268"]
[1,"Activa","VM",222,"RM-0794","PF446","-","L-34-52-5-PO","-","PUENTE ALTO","Parada 5 / (M) Elisa Correa","U7","-","-","-","-","-","14:00:00","22:00:00","-","-","-","-","-","-","-","-","-","-","F09R",null,null,null,null,null,null,null,null,null,null,null,null,null,null,null,null,null,null,null,null,1,"-","2015-01-15",353055.39,6284458.21,"ZONA PAGA V268"]
[null,"Activa","VM",223,"RM-0795","PF446","-","L-34-52-5-PO","-","PUENTE ALTO","Parada 5 / (M) Elisa Correa","U7","-","-","-","-","-","14:00:00","22:00:00","-","-","-","-","-","-","-","-","-","-","F13I",null,null,null,null,null,null,null,null,null,null,null,null,null,null,null,null,null,null,null,null,1,"-","2015-01-15",353055.39,6284458.21,"ZONA PAGA V268"]
[null,"Activa","VM",224,"RM-0796","PF446","-","L-34-52-5-PO","-","PUENTE ALTO","Parada 5 / (M) Elisa Correa","U7","-","-","-","-","-","14:00:00","22:00:00","-","-","-","-","-","-","-","-","-","-","F15R",null,null,null,null,null,null,null,null,null,null,null,null,null,null,null,null,null,null,null,null,1,"-","2015-01-15",353055.39,6284458.21,"ZONA PAGA V268"]
[null,"Activa","VM",225,"RM-0797","PF446","-","L-34-52-5-PO","-","PUENTE ALTO","Parada 5 / (M) Elisa Correa","U7","-","-","-","-","-","14:00:00","22:00:00","-","-","-","-","-","-","-","-","-","-","F24I",null,null,null,null,null,null,null,null,null,null,null,null,null,null,null,null,null,null,null,null,1,"-","2015-01-15",353055.39,6284458.21,"ZONA PAGA V268"]
[1,"Activa","ZP COMPARTIDA",226,"RM-0798","PA113","-","E-20-190-SN-40","-","SANTIAGO","Parada 3 / Mercado Central","U2","U6","-","-","-","-","15:00:00","21:00:00","-","-","-","-","-","-","-","-","-","-","203R","208I","B27R",null,null,null,null,null,null,null,null,null,null,null,null,null,null,null,null,null,null,2,"-","2015-01-17",346820.59,6299408.1699999999,"ZONA PAGA V268"]
[1,"Activa","ZP COMPARTIDA",227,"RM-0799","PB159","-","T-4-19-SN-4","-","RECOLETA","Parada 4 / Recoleta   Franciscana","U2","U6","-","-","-","-","15:00:00","21:00:00","-","-","-","-","-","-","-","-","-","-","203R","208I","B03I",null,null,null,null,null,null,null,null,null,null,null,null,null,null,null,null,null,null,1,"-","2015-01-17",346830.11,6299626.4400000004,"ZONA PAGA V268"]
[1,"Activa","ZP COMPARTIDA",228,"RM-0800","PB161","-","T-4-19-SN-10","-","RECOLETA","Parada  / (M) Patronato","U2","U6","-","-","-","-","15:00:00","21:00:00","-","-","-","-","-","-","-","-","-","-","203R","208I","116I","B03I",null,null,null,null,null,null,null,null,null,null,null,null,null,null,null,null,null,1,"-","2015-01-17",346913.13,6299951.7300000004,"ZONA PAGA V268"]
[1,"Activa","ZP COMPARTIDA",229,"RM-0801","PD187","-","E-18-12-NS-5","-","ÑUÑOA","Parada 6 / (M) Plaza Egaña","U2","U4","U7","-","-","-","15:00:00","21:00:00","-","-","-","-","-","-","-","-","-","-","216R","219eR","D02R","D15I","712R","D09R",null,null,null,null,null,null,null,null,null,null,null,null,null,null,null,2,"-","2015-01-17",353993.38,6297395.2300000004,"ZONA PAGA V268"]
[1,"Eliminada",null,230,"RM-0791","PA337","-","E-20-53-PO-40","-","SANTIAGO","Parada 8 / (M) Los Héroes","-","-","-","-","-","-","-","-","-","-","-","-","-","-","-","-","-","-",null,null,null,null,null,null,null,null,null,null,null,null,null,null,null,null,null,null,null,null,null,null,"-","2014-12-02",345526.86,6297932.9299999997,"ZONA PAGA V268"]
[1,"Activa","ZP",231,"RM-0802","PG195","PG196","T-23-205-SN-30","T-23-205-SN-35","LA PINTANA","Parada 4 / Paradero 38   Santa Rosa","U2","-","-","-","-","-","05:30:00","10:00:00","-","-","06:00:00","11:00:00","-","-","-","-","-","-","207R","209R","212R","216I","207cR","209cR",null,null,null,null,null,null,null,null,null,null,null,null,null,null,null,2,"-","2015-01-17",348906.25,6282342.25,"ZONA PAGA V268"]
[1,"Activa","ZP",232,"RM-0803","PG133","-","T-23-205-SN-45","-","LA PINTANA","Parada 2 / Plaza   de La Pintana","U2","-","-","-","-","-","05:30:00","10:00:00","-","-","06:00:00","11:00:00","-","-","-","-","-","-","205R","207R","209R","207eR","205cR","207cR","209cR",null,null,null,null,null,null,null,null,null,null,null,null,null,null,1,"-","2015-01-17",348836.51,6282971.7199999997,"ZONA PAGA V268"]
[1,"Activa","ZP",233,"RM-0804","PG1666","PG138","T-23-205-SN-72","T-23-205-SN-75","LA PINTANA","Parada 2 / Paradero 31   Santa Rosa","U2","-","-","-","-","-","05:30:00","10:00:00","-","-","06:00:00","11:00:00","-","-","-","-","-","-","205R","206R","207R","209R","212R","216I","206cR","205cR","207cR","209cR",null,null,null,null,null,null,null,null,null,null,null,2,"-","2015-01-17",348673.82,6284881.2999999998,"ZONA PAGA V268"]
[1,"Activa","ZP",234,"RM-0805","PE71","-","T-22-205-SN-15","-","LA GRANJA","Parada 2 / Hospital   Padre Hurtado","U2","-","-","-","-","-","05:45:00","10:00:00","16:00:00","20:00:00","06:00:00","11:00:00","-","-","-","-","-","-","203R","203cR","206R","212R","216I","G01R","206cR","203eR",null,null,null,null,null,null,null,null,null,null,null,null,null,2,"-","2015-01-17",348491.47,6286207.8499999996,"ZONA PAGA V268"]
[1,"Eliminada",null,235,"RM-0806","PE1313","-","T-22-205-SN-12","-","LA GRANJA","Parada 4 / Hospital   Padre Hurtado","-","-","-","-","-","-","-","-","-","-","-","-","-","-","-","-","-","-",null,null,null,null,null,null,null,null,null,null,null,null,null,null,null,null,null,null,null,null,null,null,"-","2015-01-16",348518.05,6286073.0800000001,"ZONA PAGA V268"]
[1,"Activa","ZP",236,"RM-0807","PH191","-","E-25-205-NS-77","-","SAN MIGUEL","Parada 5 / Departamental   Santa Rosa","U2","-","-","-","-","-","15:00:00","21:00:00","-","-","-","-","-","-","-","-","-","-","205I","207I","209I","227I","207eI",null,null,null,null,null,null,null,null,null,null,null,null,null,null,null,null,1,"-","2015-01-17",347812.26,6291207.4000000004,"ZONA PAGA V268"]
[1,"Activa","ZP",237,"RM-0808","PC1220","-","T-14-128-PO-34","-","PROVIDENCIA","Parada 7 / (M) Tobalaba","U6","-","-","-","-","-","06:00:00","10:00:00","-","-","-","-","-","-","-","-","-","-","C10eI","C03R",null,null,null,null,null,null,null,null,null,null,null,null,null,null,null,null,null,null,null,2,3,"2015-02-02",350893,6301090,"ZONA PAGA V268"]
[1,"Activa","ZP",238,"RM-0809","PH146","-","E-25-205-NS-76","-","SAN MIGUEL","Parada 7 / Departamental   Santa Rosa","U2","-","-","-","-","-","15:00:00","21:00:00","-","-","-","-","-","-","-","-","-","-","203I","203eI","206I","212I","206cI",null,null,null,null,null,null,null,null,null,null,null,null,null,null,null,null,1,"-","2015-02-02",347791.19,6291347.1500000004,"ZONA PAGA V268"]
[1,"Activa","ZP",239,"RM-0810","PG95","PG1616","E-24-205-NS-65","-","SAN RAMÓN","Parada 5 / (M) Santa Rosa","U2","-","-","-","-","-","05:30:00","22:00:00","-","-","06:00:00","17:00:00","-","-","-","-","-","-","206I","212I","216R","G01I","206cI","205I","207I","209I","207eI","205cR","207cR","209cR",null,null,null,null,null,null,null,null,null,4,"-","2015-02-02",348279.37,6287319.6600000001,"ZONA PAGA V268"]
[1,"Eliminada","ZP",240,"RM-0811","PG1616","-","E-24-205-NS-66","-","SAN RAMÓN","Parada 12 / (M) Santa Rosa","U2","-","-","-","-","-","05:30:00","17:00:00","-","-","06:00:00","17.00","-","-","-","-","-","-","205I","207I","209I","207eI","205cR","207cR","209cR",null,null,null,null,null,null,null,null,null,null,null,null,null,null,null,"-","2015-02-02",348279.46,6287231.2599999998,"ZONA PAGA V268"]
[1,"Activa","ZP",243,"RM-0814","PH198","-","E-21-205-SN-35","-","SAN JOAQUÍN","Parada 4 / Departamental   Santa Rosa","U2","-","-","-","-","-","05:30:00","10:30:00","-","-","06:00:00","11:00:00","-","-","-","-","-","-","205R","207R","209R","227R","207eR",null,null,null,null,null,null,null,null,null,null,null,null,null,null,null,null,1,"-","2015-03-05",347828.83,6291205.6600000001,"ZONA PAGA V268"]
[1,"Eliminada",null,244,"RM-0815","PG247","-","T-23-219-PO-10","-","LA PINTANA","Avenida Lo Blanco esq. / Av. Santa Rosa","-","-","-","-","-","-","-","-","-","-","-","-","-","-","-","-","-","-",null,null,null,null,null,null,null,null,null,null,null,null,null,null,null,null,null,null,null,null,null,null,"-","2015-03-04",348643.16,6282266.1600000001,"ZONA PAGA V268"]
[1,"Activa","ZP",245,"RM-0816","PF121","-","T-34-205-SN-15","-","PUENTE ALTO","Parada 2 / Paradero 45   Santa Rosa","U2","-","-","-","-","-","05:30:00","10:30:00","-","-","05:45:00"," 10:00","-","-","-","-","-","-","207R","209R","207eR","207cR","209cR",null,null,null,null,null,null,null,null,null,null,null,null,null,null,null,null,1,"-","2015-03-06",349094.16,6279834.1600000001,"ZONA PAGA V268"]
[1,"Activa","ZP COMPARTIDA",246,"RM-0817","PA88","-","E-20-199-NS-2","-","SANTIAGO","Parada 7 / Mercado Central","U2","U5","U6","-","-","-","15:00:00","21:00:00","-","-","07:30:00","12.00","-","-","-","-","-","-","203I","206I","208I","214R","226I","230I","203eI","402R","B02I",null,null,null,null,null,null,null,null,null,null,null,null,2,"-","2015-03-04",346708.21,6299420.9699999997,"ZONA PAGA V268"]
[1,"Activa","ZP COMPARTIDA",247,"RM-0818","PA195","-","T-20-199-NS-8","-","SANTIAGO","Parada 1 / Monjitas > San Antonio","U2","U6","-","-","-","-","15:00:00","21:00:00","-","-","-","-","-","-","-","-","-","-","203I","206I","207I","208I","214R","226I","230I","B02I",null,null,null,null,null,null,null,null,null,null,null,null,null,2,"-","2015-03-04",346743.8,6299085.4000000004,"ZONA PAGA V268"]
[1,"Activa","ZP COMPARTIDA",248,"RM-0819","PA763","-","T-20-199-NS-15","-","SANTIAGO","San Antonio esq. / Huérfanos","U2","U6","-","-","-","-","15:00:00","21:00:00","-","-","-","-","-","-","-","-","-","-","203I","206I","207I","208I","214R","226I","230I","203eI","207eI","B02I",null,null,null,null,null,null,null,null,null,null,null,2,"-","2015-03-04",346780.1,6298848.2999999998,"ZONA PAGA V268"]
[1,"Activa","ZP COMPARTIDA",249,"RM-0820","PG38","-","T-30-248-SN-25","-","SAN BERNARDO","Parada 4 / Plaza   de San Bernardo","U2","U7","-","-","-","-","06:00:00","21:00:00","-","-","10:00:00","15:00:00","-","-","-","-","-","-","G07R","G08I","G08vI","G09R","F03R",null,null,null,null,null,null,null,null,null,null,null,null,null,null,null,null,2,"-","2015-03-13",341866.13,6281578.3899999997,"ZONA PAGA V268"]
[1,"Activa","ZP COMPARTIDA",250,"RM-0821","PG39","-","T-30-248-SN-30","-","SAN BERNARDO","Freire esq. / Av. Colón -Sur","U2","U7","-","-","-","-","06:00:00","21:00:00","-","-","10:00:00","15:00:00","-","-","-","-","-","-","G07R","G08I","G08vI","G09R","F03R",null,null,null,null,null,null,null,null,null,null,null,null,null,null,null,null,2,"-","2015-03-13",341945.51,6281870.8600000003,"ZONA PAGA V268"]
[1,"Eliminada","ZP COMPARTIDA",251,"RM-0822","PG79","-","T-30-245-OP-5","-","SAN BERNARDO","Avenida Colón esq. / Eyzaguirre","U2","U7","-","-","-","-","06:00:00","11:00:00","16:00:00","21:00:00","-","-","-","-","-","-","-","-","201eR","G08vR","G14I","F03I",null,null,null,null,null,null,null,null,null,null,null,null,null,null,null,null,null,null,"-","2015-03-13",341888.84,6282037.3099999996,"ZONA PAGA V268"]
[1,"Eliminada","ZP COMPARTIDA",252,"RM-0823","PA421","-","T-20-73-OP-20","-","SANTIAGO","Parada 2 / San Antonio Santo Domingo","U5","U4","-","-","-","-","13:30:00","22:00:00","-","-","07:00:00","21:00:00","-","-","-","-","-","-","504R","505R","508R","514R","402R",null,null,null,null,null,null,null,null,null,null,null,null,null,null,null,null,null,2,"2015-06-09",346678.7,6299164.5,"ZONA PAGA V268"]
[1,"Eliminada","ZP COMPARTIDA",253,"RM-0824","PA422","-","T-20-73-OP-30","-","SANTIAGO","Parada 4 / (M) Plaza   de Armas","U5","U4","-","-","-","-","13:30:00","21:30:00","-","-","-","-","-","-","-","-","-","-","504R","505R","508R","514R","402R",null,null,null,null,null,null,null,null,null,null,null,null,null,null,null,null,null,4,"2015-07-31",346440.4,6299127.7000000002,"ZONA PAGA V268"]
[1,"Activa","ZP COMPARTIDA",255,"RM-0826","PH11","-","E-25-89-PO-16","-","SAN MIGUEL","Parada 4 / (M) Departamental","U4","U7","-","-","-","-","06:30:00","11:00:00","16:00:00","20:30:00","-","-","-","-","-","-","-","-","102I","107I","108I",null,null,null,null,null,null,null,null,null,null,null,null,null,null,null,null,null,null,1,"-","2017-05-22",346209.35,6291674.75,"ZONA PAGA V286"]
[1,"Eliminada","ZPM",256,"RM-0827","PH34","-","E-25-89-OP-21","-","SAN MIGUEL","Parada 1 / (M) Departamental","U1","-","-","-","-","-","06:30:00","11:00:00","-","-","-","-","-","-","-","-","-","-","102R","107R","108R",null,null,null,null,null,null,null,null,null,null,null,null,null,null,null,null,null,null,null,"-","2017-05-22",346361.76,6291656,"ZONA PAGA V286"]
[1,"Activa","ZP",257,"RM-0828","PD553","-","E-18-156-OP-5","-","ÑUÑOA","Parada 4 / (M) Grecia","U5","-","-","-","-","-","06:30:00","14:30:00","-","-","08:30:00","17:00:00","-","-","-","-","-","-","506R","506eR","506vR","507R","507cR","510R","511R","519R","516R",null,null,null,null,null,null,null,null,null,null,null,null,3,4,"2015-11-04",353519.68,6295592.8300000001,"ZONA PAGA V268"]
[1,"Eliminada",null,258,"RM-0829","PD553","-","E-18-156-OP-5","-","ÑUÑOA","Parada 4 / (M) Grecia","U5","-","-","-","-","-","17:00:00","21:00:00","-","-","-","-","-","-","-","-","-","-","506R","506eR","506vR","507R","507cR","510R","511R","519eR","516R",null,null,null,null,null,null,null,null,null,null,null,null,null,"-","2015-11-04",353519.68,6295592.8300000001,"ZONA PAGA V268"]
[1,"Eliminada","ZP COMPARTIDA",259,"RM-0830","PA332","-","T-20-182-PO-36","-","SANTIAGO","Parada 2 / Liceo Uno","U5","U4","-","-","-","-","06:00:00","21:30:00","-","-","-","-","-","-","-","-","-","-","504I","505I","508I","514I","402I",null,null,null,null,null,null,null,null,null,null,null,null,null,null,null,null,null,"-","2016-01-01",345969.68,6298798.8799999999,"ZONA PAGA V268"]
[1,"Eliminada","ZP COMPARTIDA",260,"RM-0831","PA417","-","T-20-182-PO-45","-","SANTIAGO","Parada 3 / (M) Plaza   de Armas","U5","U4","-","-","-","-","06:00:00","21:30:00","-","-","07:00:00","21:00:00","-","-","-","-","-","-","504I","505I","508I","514I","402I",null,null,null,null,null,null,null,null,null,null,null,null,null,null,null,null,null,"-","2016-01-01",346495.25,6298870.2199999997,"ZONA PAGA V268"]
[1,"Eliminada","ZP",261,"RM-0832","PA334","-","T-20-192-PO-17","-","SANTIAGO","Parada 1 / Miraflores   Merced","U5","-","-","-","-","-","06:00:00","21:30:00","-","-","-","-","-","-","-","-","-","-","504I","505I","508I","517I","514I",null,null,null,null,null,null,null,null,null,null,null,null,null,null,null,null,null,4,"2016-01-01",346985.25,6298937.6900000004,"ZONA PAGA V268"]
[1,"Activa","ZP",262,"RM-0833","PG116","-","E-24-205-NS-55","-","SAN RAMÓN","Parada 8 / (M) Santa Rosa","U2","-","-","-","-","-","15:00:00","21:00:00","-","-","-","-","-","-","-","-","-","-","203I","203eI","203cR",null,null,null,null,null,null,null,null,null,null,null,null,null,null,null,null,null,null,2,"-","2016-04-29",348267.84,6287444.2599999998,"ZONA PAGA V268"]
[1,"Activa","ZP",263,"RM-0834","PB303","-","E-4-19-NS-20","-","RECOLETA","Parada 3 / (M) Zapadores","U2","-","-","-","-","-","06:00:00","11:00:00","-","-","-","-","-","-","-","-","-","-","203I","208I","208cI",null,null,null,null,null,null,null,null,null,null,null,null,null,null,null,null,null,null,3,"-","2016-05-25",347234.15,6304104.2999999998,"ZONA PAGA V268"]
[1,"Activa","ZP COMPARTIDA",264,"RM-0835","PA156","-","E-20-190-SN-5","-","SANTIAGO","Parada 1 / (M) Santa Lucía","U2","U6","-","-","-","-","15:00:00","21:00:00","-","-","-","-","-","-","-","-","-","-","206R","207R","214I","226R","230I","203eR","207eR","B02I",null,null,null,null,null,null,null,null,null,null,null,null,null,4,"-","2016-06-01",346972.42,6298497.4900000002,"ZONA PAGA V268"]
[1,"Activa","ZP COMPARTIDA",265,"RM-0836","PB242","-","T-2-3-NS-4","-","CONCHALÍ","Parada 6 / Independencia   Vespucio","U2",null,"-","-","-","-","06:00:00","11:00:00","15:30:00","21:00:00","-","-","-","-","-","-","-","-","201I","214R","272I",null,null,null,null,null,null,null,null,null,null,null,null,null,null,null,null,null,null,4,"-","2016-06-01",342809.34,6306823.6399999997,"ZONA PAGA V268"]
[1,"Activa","VM",269,"RM-0840","PG1583","-","I-26-228-SN-25","-","LA CISTERNA","Parada  / Est. Intermodal   La Cisterna","U3","-","-","-","-","-","06:30:00","21:30:00","-","-","-","-","-","-","-","-","-","-","301cI","301c2I",null,null,null,null,null,null,null,null,null,null,null,null,null,null,null,null,null,null,null,2,"-","2016-06-01",345540.33,6287776.1799999997,"ZONA PAGA V268"]
[1,"Suspendida ","ZP",270,"RM-0841","PA450","-","E-20-189-OP-40","-","SANTIAGO","Parada 1 / (M) Parque   O'Higgins","U5","-","-","-","-","-","06:00:00","21:00:00","-","-","06:30:00","21:00:00","-","-","-","-","-","-","506R","507R","509R","510R","506eR","506vR",null,null,null,null,null,null,null,null,null,null,null,null,null,null,null,1,2,"2016-06-01",346022.13,6296456.4100000001,"ZONA PAGA V268"]
[1,"Suspendida ","ZP",271,"RM-0842","PD524","-","E-18-156-PO-5","-","ÑUÑOA","Parada 3 / (M) Irarrázaval","U5","-","-","-","-","-","06:00:00","21:00:00","-","-","06:30:00","21:00:00","-","-","-","-","-","-","506I","506vI","506eI","507I","507cI","510I",null,null,null,null,null,null,null,null,null,null,null,null,null,null,null,3,3,"2016-06-27",348617.96,6297033.2999999998,"ZONA PAGA V268"]
[1,"Activa","ZP",272,"RM-0843","PA435","-","E-20-189-PO-5","-","SANTIAGO","Parada 4 / (M) Parque   O'Higgins","U5","-","-","-","-","-","06:30:00","14:30:00","-","-","09:00:00","17:00:00","-","-","-","-","-","-","506I","506vI","506eI","507I","507cI","510I",null,null,null,null,null,null,null,null,null,null,null,null,null,null,null,2,4,"2016-06-27",346025.17,6296416.5199999996,"ZONA PAGA V268"]
[1,"Activa","ZP",273,"RM-0844","PD564","-","E-18-156-OP-70","-","ÑUÑOA","Parada 2 / (M) Irarrázaval","U5","-","-","-","-","-","12:00:00","20:00:00","-","-","09:00:00","17:00:00","-","-","-","-","-","-","506R","506vR","506eR","507R","507cR","510R","516R","519R",null,null,null,null,null,null,null,null,null,null,null,null,null,2,3,"2016-06-27",348682.44,6297083.3300000001,"ZONA PAGA V268"]
[1,"Activa","ZP",274,"RM-0845","PD535","-","E-18-156-PO-80","-","ÑUÑOA","Parada 5 / (M) Grecia","U5","-","-","-","-","-","06:30:00","20:00:00","-","-","08:30:00","18:00:00","-","-","-","-","-","-","506I","507I","510I","511I","516I","506eI","506vI","507cI","519I",null,null,null,null,null,null,null,null,null,null,null,null,3,5,"2016-06-27",353516.89,6295579.6200000001,"ZONA PAGA V268"]
[1,"Activa","ZP","275","RM-0846","PA396","-","E-20-290-OP-20","-","SANTIAGO","Parada 3 / Estación Mapocho","U5","-","-","-","-","-","07:00:00","20:00:00","-","-","07:00:00","20:00:00","-","-","-","-","-","-","502R","502cR","503R","509R","517R",null,null,null,null,null,null,null,null,null,null,null,null,null,null,null,null,3,4,"2016-06-27",346337.71,6299501.46,"ZONA PAGA V268"]
[1,"Eliminada","ZP",276,"RM-0847","PD381","-","T-32-316-OP-30","-","PEÑALOLÉN","Parada 4 / (M) Los   Presidentes","U4","-","-","-","-","-","17:00:00","20:00:00","-","-","-","-","-","-","-","-","-","-","425R","429R","420eI",null,null,null,null,null,null,null,null,null,null,null,null,null,null,null,null,null,null,null,2,"2016-07-08",353356.59,6294384.4500000002,"ZONA PAGA V268"]
[1,"Suspendida ","ZP",277,"RM-0848","PE351","-","L-33-65-5-OP","-","LA FLORIDA","Parada 4 / (M) Trinidad","U3","-","-","-","-","-","17:00:00","21:30:00","-","-","-","-","-","-","-","-","-","-","E02R","E12I",null,null,null,null,null,null,null,null,null,null,null,null,null,null,null,null,null,null,null,2,2,"2016-07-08",352636.11,6286935.8300000001,"ZONA PAGA V268"]
[1,"Eliminada","ZP",278,"RM-0849","PC255","-","T-15-135-OP-55","-","VITACURA","Parada 4 / Los Cobres   de Vitacura","U4","-","-","-","-","-","17:00:00","21:00:00","-","-","-","-","-","-","-","-","-","-","414eR",null,null,null,null,null,null,null,null,null,null,null,null,null,null,null,null,null,null,null,null,null,2,"2016-07-08",354187.54,6304550.2599999998,"ZONA PAGA V268"]
[1,"Activa","ZP",279,"RM-0850","PA547","-","T-20-68-SN-23","-","SANTIAGO","Parada 3 / (M) Quinta Normal","U5","-","-","-","-","-","06:00:00","22:00:00","-","-","06:30:00","21:00:00","-","-","-","-","-","-","J01R","J02I","J05I","J16I","J19R",null,null,null,null,null,null,null,null,null,null,null,null,null,null,null,null,2,3,"2016-07-08",343858.5,6298610.71,"ZONA PAGA V268"]
[1,"Eliminada","ZP",280,"RM-0851","PJ884","-","L-9-3-27-OP","-","LO PRADO","Parada 6 / (M) Neptuno","U5","-","-","-","-","-","13:00:00","22:00:00","-","-","-","-","-","-","-","-","-","-","514R","J10R","J19R",null,null,null,null,null,null,null,null,null,null,null,null,null,null,null,null,null,null,null,2,"2016-07-08",339945.54,6297310.6100000003,"ZONA PAGA V268"]
[1,"Eliminada","ZP",281,"RM-0852","PJ686","-","L-9-13-60-NS","-","LO PRADO","Parada 3 / (M) Neptuno","U5","-","-","-","-","-","06:00:00","22:00:00","-","-","-","-","-","-","-","-","-","-","511I","J04I","J08R",null,null,null,null,null,null,null,null,null,null,null,null,null,null,null,null,null,null,null,2,"2016-07-08",339845.82,6297447.5999999996,"ZONA PAGA V268"]
[1,"Eliminada","ZP",282,"RM-0853","PA378","-","E-20-68-SN-5","-","SANTIAGO","Parada 1 / (M) Estación Central","U4","-","-","-","-","-","16:00:00","20:30:00","-","-","-","-","-","-","-","-","-","-","406R","422R","426R",null,null,null,null,null,null,null,null,null,null,null,null,null,null,null,null,null,null,null,"-","2016-08-29",343953.86,6297545.1200000001,"ZONA PAGA V268"]
[1,"Activa","ZP",283,"RM-0854","PI67","-","E-7-51-NS-15","-","ESTACIÓN CENTRAL","Parada 7 / (M) San   Alberto Hurtado","U6","-","-","-","-","-","-","-","12:30:00","21:30:00","-","-","-","-","-","-","-","-","105I","120I",null,null,null,null,null,null,null,null,null,null,null,null,null,null,null,null,null,null,null,2,"-","2016-08-29",342804.63,6297184.5300000003,"ZONA PAGA V268"]
[1,"Activa","ZP COMPARTIDA",284,"RM-0856","PA91","-","E-20-199-NS-25","-","SANTIAGO","Parada 11 / (M) Santa Lucía","U2","U6","-","-","-","-","06:30:00","11:30:00","15:00:00","20:30:00","07:30:00","12:00:00","-","-","-","-","-","-","203I","206I","207I","208I","214R","226I","230I","203eI","207eI","B02I",null,null,null,null,null,null,null,null,null,null,null,4,"-","2016-09-30",346825.39,6298500.8799999999,"ZONA PAGA V268"]
[1,"Activa","ZP",285,"RM-0857","PA115","-","E-20-205-SN-65","-","SANTIAGO","Parada 6 / (M) Santa Lucía","U2","-","-","-","-","-","06:30:00","21:00:00","-","-","07:30:00","12:00:00","-","-","-","-","-","-","204I","204eI",null,null,null,null,null,null,null,null,null,null,null,null,null,null,null,null,null,null,null,3,"-","2016-09-30",347012.18,6298353.4299999997,"ZONA PAGA V268"]
[1,"Activa","ZP",286,"RM-0858","PI1075","-","L-7-44-10-NS","-","ESTACIÓN CENTRAL","Parada 9 / (M) Estación Central","U3","-","-","-","-","-","06:30:00","09:00:00","17:00:00","21:00:00","-","-","-","-","-","-","-","-","313eR","I10R","I17R",null,null,null,null,null,null,null,null,null,null,null,null,null,null,null,null,null,null,2,"-","2016-10-17",343935.43,6297521.7599999998,"ZONA PAGA V268"]
[1,"Activa","ZP COMPARTIDA",287,"RM-0859","PB1575","-","I-4-12-PO-11","-","RECOLETA","Parada  / Est. Intermodal   Vespucio Norte","U6","U4","-","-","-","-","06:30:00","21:30:00","-","-","-","-","-","-","-","-","-","-","B13I","B16R","B18R","B25I","B27I","117I",null,null,null,null,null,null,null,null,null,null,null,null,null,null,null,5,4,"2016-12-05",346745.57,6305333.6500000004,"ZONA PAGA V268"]
[1,"Suspendida ","ZP",288,"RM-0860","PG342","-","T-26-228-NS-38","-","LA CISTERNA","Parada 12 / (M) La Cisterna","U3","-","-","-","-","-","17:00:00","20:00:00","-","-","-","-","-","-","-","-","-","-","301I",null,null,null,null,null,null,null,null,null,null,null,null,null,null,null,null,null,null,null,null,2,3,"2016-10-19",345463.63,6287953.2300000004,"ZONA PAGA V268"]
[1,"Eliminada","ZPM",289,"RM-0861","PH2","-","T-28-89-PO-10","-","PEDRO AGUIRRE CERDA","Av. Departamental esq. / Haití","U1","-","-","-","-","-","06:30:00","11:00:00","-","-","-","-","-","-","-","-","-","-","102I","107I","108I",null,null,null,null,null,null,null,null,null,null,null,null,null,null,null,null,null,null,null,4,"2016-10-24",343515.18,6293341.1699999999,"ZONA PAGA V268"]
[1,"Activa","ZP COMPARTIDA",290,"RM-0862","PB7","-","E-4-9-OP-5","-","RECOLETA","Parada 4 / (M) Dorsal","U4","U7","-","-","-","-","06:30:00","11:00:00","16:00:00","20:30:00","-","-","-","-","-","-","-","-","101I","107I","107cI",null,null,null,null,null,null,null,null,null,null,null,null,null,null,null,null,null,null,1,"-","2016-10-24",347173.7,6303519.1699999999,"ZONA PAGA V268"]
[1,"Activa","ZP COMPARTIDA",291,"RM-0863","PJ627","-","L-10-36-5-NS","-","PUDAHUEL","Parada 1 / (M) Barrancas","U5","U3","-","-","-","-","12:00:00","20:00:00","-","-","12:00:00","19:30:00","-","-","-","-","-","-","111I","510R","516R","J01R","J08R","J19R",null,null,null,null,null,null,null,null,null,null,null,null,null,null,null,2,4,"2016-11-14",338365.66,6297136.0199999996,"ZONA PAGA V268"]
[1,"Suspendida ","ZP",292,"RM-0864","PE63","-","T-22-205-SN-10","-","LA GRANJA","Parada 2 / Paradero 30   Santa Rosa","U2","-","-","-","-","-","05:30:00","10:30:00","-","-","06:00:00","11:00:00","-","-","-","-","-","-","212R","203R","206R","216I","203eR","206cR","G01R","203cR",null,null,null,null,null,null,null,null,null,null,null,null,null,2,"-","2016-11-24",348564.92,6285842.5199999996,"ZONA PAGA V268"]
[1,"Eliminada","ZP",293,"RM-0865","PG1664","-","T-23-205-NS-17","-","LA PINTANA","Parada 3 / Paradero 31   Santa Rosa","U2","-","-","-","-","-","15:00:00","20:00:00","-","-","-","-","-","-","-","-","-","-","205I","206I","212I","216R","206cI","205cR",null,null,null,null,null,null,null,null,null,null,null,null,null,null,null,null,"-","2016-11-24",348657.85,6284905.2300000004,"ZONA PAGA V268"]
[1,"Suspendida ","ZP",294,"RM-0866","PD576","-","T-32-156-OP-75","-","PEÑALOLÉN","Parada 2 / Los Molineros   Av. Grecia","U5","-","-","-","-","-","06:00:00","14:00:00","-","-","-","-","-","-","-","-","-","-","505R","506R","507R","510R","516R","506eR","506vR","507cR","519R",null,null,null,null,null,null,null,null,null,null,null,null,2,2,"2016-11-23",354329,6295410.0800000001,"ZONA PAGA V268"]
[1,"Suspendida ","ZP",295,"RM-0867","PD575","-","T-32-156-OP-50","-","PEÑALOLÉN","Parada 2 / Ictinos   Avenida Grecia","U5","-","-","-","-","-","06:00:00","14:00:00","-","-","-","-","-","-","-","-","-","-","506R","507R","510R","506vR","507cR","519R",null,null,null,null,null,null,null,null,null,null,null,null,null,null,null,2,2,"2016-11-23",354874.43,6295292.1299999999,"ZONA PAGA V268"]
[1,"Activa","ZP",296,"RM-0868","PD558","PD559","T-18-156-OP-38","T-18-156-OP-40","ÑUÑOA","Parada 2 y 4 / Pedagógico","U5","-","-","-","-","-","06:00:00","21:30:00","-","-","06:30:00","21:00:00","-","-","-","-","-","-","508R","511R","506R","507R","510R","516R","506eR","506vR","507cR","519R",null,null,null,null,null,null,null,null,null,null,null,3,4,"2016-11-23",351574.8,6296069.79,"ZONA PAGA V268"]
[1,"Activa","ZP",297,"RM-0869","PA300","-","E-20-289-PO-5","-","SANTIAGO","Parada 9 / Estación Mapocho","U5","-","-","-","-","-","07:00:00","11:00:00","-","-","07:00:00","11:00:00","-","-","-","-","-","-","404R","502I","503I","517I","502cI",null,null,null,null,null,null,null,null,null,null,null,null,null,null,null,null,3,4,"2016-12-07",346251.46,6299460.0700000003,"ZONA PAGA V268"]
[1,"Activa","ZP",298,"RM-0870","PB1884","-","T-4-22-SN-4","-","RECOLETA","Parada 6 / Estación Mapocho","U3","-","-","-","-","-","06:30:00","21:30:00","-","-","11:00:00","18:00:00","-","-","11:00:00","18:00:00","-","-","301R","308R",null,null,null,null,null,null,null,null,null,null,null,null,null,null,null,null,null,null,null,2,3,"2016-12-06",346469.54,6299664.2199999997,"ZONA PAGA V268"]
[1,"Eliminada","ZP",299,"RM-0871","PC255","-","T-15-135-OP-55","-","VITACURA","Parada 4 / Los Cobres   de Vitacura","U5","-","-","-","-","-","17:30:00","20:30:00","-","-","-","-","-","-","-","-","-","-","546eR",null,null,null,null,null,null,null,null,null,null,null,null,null,null,null,null,null,null,null,null,null,2,"2016-12-09",354187.54,6304550.2599999998,"ZONA PAGA V268"]
[1,"Suspendida ","ZP COMPARTIDA",300,"RM-0872","PA62","-","T-20-200-NS-5","-","SANTIAGO","Parada 1 / (M) Franklin","U3","U2","-","-","-","-","13:00:00","21:30:00","-","-","13:00:00","20:00:00","-","-","13:00:00","20:00:00","-","-","201I","214R","223I","226I","229I","301I","H13","271I",null,null,null,null,null,null,null,null,null,null,null,null,null,2,"-","2017-01-30",346834.58,6294795.7599999998,"ZONA PAGA V268"]
[1,"Eliminada","ZP COMPARTIDA",301,"RM-0873","PA368","-","E-20-53-PO-5","-","SANTIAGO","Parada 4 / (M) Estación Central","U4","U1","U2","U3","U5",null,"06:30:00","11:00:00","16:00:00","20:30:00","-","-","-","-","-","-","-","-","106I","210I","346nI","401I","405I","406I","419I","422I","423I","424I","426I","427I","507I","510I","511I","513I","516I","541nI","I08nI","I10nI",null,null,"-","2017-01-17",344122.81,6297496.8399999999,"ZONA PAGA V268"]
[1,"Eliminada","ZP COMPARTIDA",302,"RM-0874","Parada Provisoria","-",null,"-","ESTACIÓN CENTRAL","Alameda / San Borja","U4","U2","U3","U5","-","-","06:30:00","11:00:00","16:00:00","20:30:00","-","-","-","-","-","-","-","-","210I","210vI","221eR","385I","404I","407I","412I","418I","421I","516I","I17I","J10I",null,null,null,null,null,null,null,null,null,null,"-","2017-01-17","-","-","ZONA PAGA V268"]
[1,"Activa","ZP COMPARTIDA",303,"RM-0875","PG367","-","T-30-246-SN-5","-","SAN BERNARDO","Ducaud esq. / Lago Huilipilún","U3","U2","-","-","-","-","06:30:00","10:00:00","-","-","-","-","-","-","-","-","-","-","301R","301cR","228R",null,null,null,null,null,null,null,null,null,null,null,null,null,null,null,null,null,null,1,"-","2017-02-20",343688.31,6280859.6699999999,"ZONA PAGA V268"]
[1,"Activa","ZP COMPARTIDA",304,"RM-0876","PG1642","-","T-30-246-SN-10","-","SAN BERNARDO","Ducaud esq. / Carlos Condell","U3","U2","-","-","-","-","06:30:00","10:00:00","-","-","-","-","-","-","-","-","-","-","301R","301cR","228R",null,null,null,null,null,null,null,null,null,null,null,null,null,null,null,null,null,null,1,"-","2017-02-20",343735.92,6281098.6500000004,"ZONA PAGA V268"]
[1,"Activa","ZP COMPARTIDA",305,"RM-0877","PG368","-","T-30-272-PO-5","-","SAN BERNARDO","Condell esq. / Av. Padre Hurtado","U3","U2","-","-","-","-","06:30:00","10:00:00","-","-","-","-","-","-","-","-","-","-","301R","301cR","G09R",null,null,null,null,null,null,null,null,null,null,null,null,null,null,null,null,null,null,2,"-","2017-02-20",343997.65,6281031.3600000003,"ZONA PAGA V268"]
[1,"Activa","ZP COMPARTIDA",306,"RM-0878","PG1573","-","T-26-228-SN-20","-","LA CISTERNA","Parada 5 / (M) La Cisterna","U2","U3","-","-","-","-","06:00:00","11:00:00","-","-","-","-","-","-","-","-","-","-","211R","301c2R",null,null,null,null,null,null,null,null,null,null,null,null,null,null,null,null,null,null,null,2,"-","2017-02-20",345444.50069999998,6287691.4820999997,"ZONA PAGA V369"]
[1,"Activa","ZP COMPARTIDA",307,"RM-0879","PI80","-","E-7-51-SN-30","-","ESTACIÓN CENTRAL","Parada 1 / (M) San   Alberto Hurtado","U6","U5","-","-","-","-","-","-","12:30:00","21:30:00","-","-","-","-","-","-","-","-","105R","120R","407R",null,null,null,null,null,null,null,null,null,null,null,null,null,null,null,null,null,null,1,"-","2017-04-24",342856.47,6297192.2599999998,"ZONA PAGA V278"]
[1,"Eliminada","ZP COMPARTIDA",308,"RM-0880","PI46","-","E-7-52-SN-30","-","ESTACIÓN CENTRAL","Parada 1 / (M) Las Rejas","U1","U3","-","-","-","-","06:30:00","11:00:00","-","-","-","-","-","-","-","-","-","-","101R","107R","I10I",null,null,null,null,null,null,null,null,null,null,null,null,null,null,null,null,null,null,null,"-","2017-03-01",341499.35,6296667.6200000001,"ZONA PAGA V268"]
[1,"Eliminada","ZPM",309,"RM-0881","PJ18","-","E-9-52-NS-20","-","LO PRADO","Parada 11 / (M) Las Rejas","U1","-","-","-","-","-","06:30:00","11:00:00","-","-","-","-","-","-","-","-","-","-","101I","102I","107I","101cI",null,null,null,null,null,null,null,null,null,null,null,null,null,null,null,null,null,null,"-","2017-03-01",341476.72,6296769.4800000004,"ZONA PAGA V268"]
[1,"Suspendida ","ZP COMPARTIDA",310,"RM-0882","PB541","-","T-6-327-PO-3","-","QUILICURA","Avenida Lo Marcoleta esq. / Pquia. Jesús Obrero","U6","U3","-","-","-","-","06:00:00","14:00:00","-","-","-","-","-","-","-","-","-","-","314I","B12cI","B08I","B12R","314cI",null,null,null,null,null,null,null,null,null,null,null,null,null,null,null,null,2,4,"2017-03-20",336296.52,6307096.1299999999,"ZONA PAGA V268"]
[1,"Suspendida ","ZP COMPARTIDA",311,"RM-0883","PB534","-","L-6-24-5-PO","-","QUILICURA","Avenida Lo Marcoleta esq. / Ntra. Sra. del Carmen","U3","U6","-","-","-","-","06:00:00","10:00:00","-","-","-","-","-","-","-","-","-","-","307I","308I","315eI","B06R","B08I","B11R","B21R","308cI","307cI","315cI",null,null,null,null,null,null,null,null,null,null,null,2,"-","2017-03-20",336470.64,6307136.5700000003,"ZONA PAGA V268"]
[1,"Eliminada","ZP COMPARTIDA",312,"RM-0884","PB535","-",null,"-","QUILICURA","Avenida Lo Marcoleta esq. / Los Benedictinos","U3","U6","-","-","-","-","06:00:00","12:00:00","-","-","-","-","-","-","-","-","-","-","307I","308I","314I","314eI","315eI","B06R","B08I","B11R","B12R","B13R","B21R",null,null,null,null,null,null,null,null,null,null,null,"-","2017-03-20",336726.35,6307195.5700000003,"ZONA PAGA V268"]
[1,"Suspendida ","ZP COMPARTIDA",313,"RM-0885","PB620","-","L-6-40-7-NS","-","QUILICURA","San Luis esq. / Pasaje 9","U3","U6","-","-","-","-","06:30:00","10:00:00","-","-","-","-","-","-","-","-","-","-","314I","B12R","B12cI","314cI",null,null,null,null,null,null,null,null,null,null,null,null,null,null,null,null,null,1,"-","2017-03-20",336810.16,6307192.54,"ZONA PAGA V268"]
[1,"Suspendida ","ZP COMPARTIDA",314,"RM-0886","PB574","-","L-6-40-10-NS","-","QUILICURA","San Luis esq. / Av. Manuel A. Matta","U6","U3","-","-","-","-","06:00:00","14:00:00","-","-","-","-","-","-","-","-","-","-","308I","314I","B08I","B11R","B12R","308cI","B12cI","314cI",null,null,null,null,null,null,null,null,null,null,null,null,null,2,4,"2017-03-20",336869.41,6307045.79,"ZONA PAGA V268"]
[1,"Eliminada","ZP COMPARTIDA",315,"RM-0887","PB536","-","T-6-327-PO-5","-","QUILICURA","Avenida Lo Marcoleta / esq.  Pascual Gambino","U6","U3","-","-","-","-","06:00:00","12:00:00","-","-","-","-","-","-","-","-","-","-","307I","315eI","B06R","B13R","B21R",null,null,null,null,null,null,null,null,null,null,null,null,null,null,null,null,null,"-","2017-03-20",336924.03,6307232.2000000002,"ZONA PAGA V268"]
[1,"Suspendida ","ZP COMPARTIDA",316,"RM-0888","PB537","-","T-6-327-PO-10","-","QUILICURA","Avenida Lo Marcoleta esq. / Volcán Copahue","U3","U6","-","-","-","-","06:30:00","10:00:00","-","-","-","-","-","-","-","-","-","-","307I","315eI","B21R","307cI","315cI",null,null,null,null,null,null,null,null,null,null,null,null,null,null,null,null,1,"-","2017-03-20",337337.83,6307327.8799999999,"ZONA PAGA V268"]
[1,"Eliminada","ZP COMPARTIDA",317,"RM-0889","PJ118","-","T-10-71-PO-33","-","PUDAHUEL","Parada 1 / Consultorio   Pudahuel -Poniente","U4","U5","-","-","-","-","06:30:00","11:00:00","17:00:00","20:30:00","-","-","-","-","-","-","-","-","402I","406I","407I","426I","J07I","J07eI","486I",null,null,null,null,null,null,null,null,null,null,null,null,null,null,null,"-","2017-04-24",335983.37,6298295.9900000002,"ZONA PAGA V278"]
[1,"Eliminada","ZP",318,"RM-0890","PJ153","-","E-10-71-OP-4","-","PUDAHUEL","Parada 1 / (M) Pudahuel","U4","-","-","-","-","-","06:30:00","11:00:00","17:00:00","20:30:00","-","-","-","-","-","-","-","-","402R","406R","426R","486I","407R",null,null,null,null,null,null,null,null,null,null,null,null,null,null,null,null,null,"-","2017-04-24",338154.45,6298072.2800000003,"ZONA PAGA V278"]
[1,"Activa","ZP ",319,"RM-0891","PJ84","-","E-9-75-SN-12","-","LO PRADO","Parada 2 / (M) Pudahuel","U5","-","-","-","-","-","06:30:00","20:00:00","-","-","07:00:00","20:00:00","-","-","-","-","-","-","110R","110cR",null,null,null,null,null,null,null,null,null,null,null,null,null,null,null,null,null,null,null,1,"-","2017-04-24",338221.34,6298031.4699999997,"ZONA PAGA V278"]
[1,"Eliminada","ZP",320,"RM-0892","PJ128","-","E-9-71-PO-32","-","LO PRADO","Parada 6 / (M) San Pablo","U4","-","-","-","-","-","06:30:00","11:00:00","17:00:00","20:30:00","-","-","-","-","-","-","-","-","402I","406I","407I","422I","426I","486I",null,null,null,null,null,null,null,null,null,null,null,null,null,null,null,null,"-","2017-04-24",339706.93,6298111.9699999997,"ZONA PAGA V278"]
[1,"Eliminada","ZP COMPARTIDA",321,"RM-0893","PA260","-","T-20-73-OP-5","-","SANTIAGO","Santo Domingo esq. / Miraflores","U5","U6","-","-","-","-","14:00:00","21:30:00","-","-","14:00:00","21:30:00","-","-","-","-","-","-","504R","505R","508R","517R","502cR","B27R",null,null,null,null,null,null,null,null,null,null,null,null,null,null,null,null,2,"2017-04-17",347027.7,6299218.2000000002,"ZONA PAGA V278"]
[1,"Activa","ZP COMPARTIDA",322,"RM-0894","PA261","-","T-20-73-OP-15","-","SANTIAGO","Parada 4 / San Antonio   Santo Domingo","U3","U2","-","-","-","-","16:00:00","21:00:00","-","-","-","-","-","-","-","-","-","-","214I","303R","307I","314I","307eR","315eR",null,null,null,null,null,null,null,null,null,null,null,null,null,null,null,2,"-","2017-04-17",346770.7,6299176.5,"ZONA PAGA V278"]
[1,"Activa","ZP COMPARTIDA",323,"RM-0895","PA262","-","T-20-73-OP-25","-","SANTIAGO","Parada 2 / (M) Plaza   de Armas","U3","U2","-","-","-","-","16:00:00","21:00:00","-","-","-","-","-","-","-","-","-","-","214I","303R","307I","314I",null,null,null,null,null,null,null,null,null,null,null,null,null,null,null,null,null,2,"-","2017-04-17",346519.7,6299141.5999999996,"ZONA PAGA V278"]
[1,"Eliminada","ZP",324,"RM-0896","PA423","-","T-20-73-OP-40","-","SANTIAGO","Santo Domingo esq. / Teatinos","U3","-","-","-","-","-","16:00:00","21:00:00","-","-","-","-","-","-","-","-","-","-","303R","307I","314I",null,null,null,null,null,null,null,null,null,null,null,null,null,null,null,null,null,null,null,"-","2017-04-17",346107.5,6299078.0999999996,"ZONA PAGA V278"]
[1,"Activa","ZP COMPARTIDA",325,"RM-0897","PA303","-","T-20-73-OP-50","-","SANTIAGO","Parada 1 / (M) Santa Ana","U3","U6","-","-","-","-","06:30:00","21:30:00","-","-","-","-","-","-","-","-","-","-","303R","307I","314I","307eR","315eR","B29R",null,null,null,null,null,null,null,null,null,null,null,null,null,null,null,2,"-","2017-04-17",345790.3,6299034.7000000002,"ZONA PAGA V278"]
[1,"Eliminada","ZPM",326,"RM-0898","PA264","-","T-20-73-OP-45","-","SANTIAGO","Parada 2 / (M) Santa Ana","U5","-","-","-","-","-","16:00:00","21:00:00","-","-","-","-","-","-","-","-","-","-","504R","505R","508R","514R",null,null,null,null,null,null,null,null,null,null,null,null,null,null,null,null,null,null,"-","2017-04-26",345937.4,6299054.7000000002,"ZONA PAGA V278"]
[1,"Eliminada","ZP COMPARTIDA",327,"RM-0899","PA245","-","T-20-188-SN-75","-","SANTIAGO","Parada 2 / Teatro Teletón","U3","U6","-","-","-","-","16:00:00","21:00:00","-","-","-","-","-","-","-","-","-","-","303R","307I","314I","B29R",null,null,null,null,null,null,null,null,null,null,null,null,null,null,null,null,null,null,"-","2017-04-26",345710.33,6299131.4800000004,"ZONA PAGA V278"]
[1,"Eliminada","ZP",328,"RM-0900","PB82","-","E-5-30-OP-20","-","RENCA","Parada 1 / Plaza Renca","U1","-","-","-","-","-","06:30:00","09:30:00","16:00:00","20:30:00","-","-","-","-","-","-","-","-","105R","109R","110I","120R","408R","410R","408eR",null,null,null,null,null,null,null,null,null,null,null,null,null,null,null,"-","2017-05-02",341446.31,6302547.96,"ZONA PAGA V278"]
[1,"Activa","ZP COMPARTIDA",329,"RM-0901","PB25","-","E-5-38-SN-5","-","RENCA","Parada 2 / Plaza Renca","U4","U6","U7","-","-","-","06:30:00","11:00:00","16:00:00","20:30:00","-","-","-","-","-","-","-","-","101R","107R","107cR","B28I",null,null,null,null,null,null,null,null,null,null,null,null,null,null,null,null,null,1,"-","2017-05-02",341576.76,6302530.5300000003,"ZONA PAGA V278"]
[1,"Eliminada","ZP COMPARTIDA",330,"RM-0902","PB108","-","E-5-38-NS-5","-","RENCA","Parada 3 / Plaza Renca","U4","U6","-","-","-","-","06:30:00","11:00:00","16:00:00","20:30:00","-","-","-","-","-","-","-","-","101I","107I","107cI","B28I",null,null,null,null,null,null,null,null,null,null,null,null,null,null,null,null,null,null,"-","2017-05-02",341543.82,6302496.9299999997,"ZONA PAGA V278"]
[1,"Suspendida ","ZP COMPARTIDA",331,"RM-0903","PB536","-","T-6-327-PO-5","-","QUILICURA","Avenida Lo Marcoleta / esq.  Pascual Gambino","U6","U3","-","-","-","-","06:00:00","10:00:00","-","-","-","-","-","-","-","-","-","-","307I","315eI","B06R","B21R","307cI","315cI",null,null,null,null,null,null,null,null,null,null,null,null,null,null,null,2,3,"2017-05-08",336924.03,6307232.2000000002,"ZONA PAGA V278"]
[1,"Activa","ZP",332,"RM-0904","PI952","-","L-13-15-100-PO","-","MAIPÚ","Parada 1 / Nudo Rinconada","U3","-","-","-","-","-","06:30:00","10:00:00","-","-","-","-","-","-","-","-","-","-","I05I","I07I","I09I","I09cI","I09eI","I24I","I11R",null,null,null,null,null,null,null,null,null,null,null,null,null,null,2,"-","2017-05-08",333001.65000000002,6291013.71,"ZONA PAGA V278"]
[1,"Eliminada","ZP",333,"RM-0905","PD518","-","E-18-157-OP-10","-","ÑUÑOA","Parada 4 / (M) Plaza Egaña","U5","-","-","-","-","-","06:30:00","21:00:00","-","-","07:00:00"," 20:30","-","-","-","-","-","-","505R","513R","513vR",null,null,null,null,null,null,null,null,null,null,null,null,null,null,null,null,null,null,null,"-","2017-05-26",353883.33,6297344.7599999998,"ZONA PAGA V278"]
[1,"Activa","ZPF",334,"RM-0906","PG1585 (Sólo andén 3)","-","I-26-228-NS-3","-","LA CISTERNA","Parada  / Est. Intermodal   Lo Ovalle","U3","-","-","-","-","-","14:00:00","21:30:00","-","-","-","-","-","-","-","-","-","-","E02I","E03I",null,null,null,null,null,null,null,null,null,null,null,null,null,null,null,null,null,null,null,1,"-","2017-05-29",345927.99,6290128.9699999997,"ZONA PAGA V278"]
[1,"Activa","ZP COMPARTIDA",335,"RM-0907","PF97","-","T-34-270-SN-10","-","PUENTE ALTO","Parada 2 / (M) Las Mercedes","U7","U2","-","-","-","-","14:30:00","22:30:00","-","-","-","-","-","-","-","-","-","-","F01R","F10I","F13I","F15I","F16R","F19I","F25I","F29R","205R","210R","205cR","213eR","F10cI",null,null,null,null,null,null,null,null,2,4,"2017-06-07",353641.92,6280976.9900000002,"ZONA PAGA V285"]
[1,"Activa","ZP",336,"RM-0908","PE1318","-","E-22-205-SN-34","-","LA GRANJA","Parada 11 / (M) Santa Rosa","U3","-","-","-","-","-","06:30:00","21:00:00","-","-","-","-","-","-","-","-","-","-","E01R","E09R","E16R",null,null,null,null,null,null,null,null,null,null,null,null,null,null,null,null,null,null,2,"-","2017-06-19",348312.64,6287277.4800000004,"ZONA PAGA V285"]
[1,"Eliminada","ZP COMPARTIDA",337,"RM-0909","PA15","-","T-20-176-SN-40","-","SANTIAGO","Parada  / Estadio   Victor Jara","U3","U5","-","-","-","-","16:00:00","21:00:00","-","-","-","-","-","-","-","-","-","-","345I","I09R","I09eR","I14R","I17I","I18I",null,null,null,null,null,null,null,null,null,null,null,null,null,null,null,null,"-","2017-06-19",344279.18,6297518.6100000003,"ZONA PAGA V285"]
[1,"Eliminada","ZP COMPARTIDA",338,"RM-0910","PA367","-","E-20-53-OP-125","-","SANTIAGO","Parada 3 / (M) Estación Central","U3","U5","-","-","-","-","16:00:00","21:00:00","-","-","-","-","-","-","-","-","-","-","I09R","I09ER","I14R",null,null,null,null,null,null,null,null,null,null,null,null,null,null,null,null,null,null,null,"-","2017-06-19",344099.93,6297543.5300000003,"ZONA PAGA V285"]
[1,"Activa","ZP",339,"RM-0911","PF761","-","L-34-30-33-OP","-","PUENTE ALTO","Parada 4 / Paradero 38   Av.Vicuña Mackenna","U7","-","-","-","-","-","17:00:00","22:30:00","-","-","-","-","-","-","-","-","-","-","F02I","F29I",null,null,null,null,null,null,null,null,null,null,null,null,null,null,null,null,null,null,null,1,3,"2017-06-28",353617.19,6280748.46,"ZONA PAGA V285"]
[1,"Eliminada","ZPM",340,"RM-0912","PJ1604","-","T-10-71-OP-4","-","PUDAHUEL","Parada 6 / (M) Pudahuel","U5","-","-","-","-","-","06:30:00","10:30:00","16:30:00","21:30:00","-","-","-","-","-","-","-","-","511R","J07I","J07CI","J07EI","J15CR","J20I",null,null,null,null,null,null,null,null,null,null,null,null,null,null,null,null,"-","2017-07-05",338110.93,6298072.3300000001,"ZONA PAGA V285"]
[1,"Eliminada","ZP COMPARTIDA",341,"RM-0913","PA264","-","T-20-73-OP-45","-","SANTIAGO","Parada 2 / (M) Santa Ana","U5","U4","-","-","-","-","13:30:00","21:30:00","-","-","07:00:00"," 20:30","-","-","-","-","-","-","504R","505R","508R","514R","402R",null,null,null,null,null,null,null,null,null,null,null,null,null,null,null,null,null,3,"2017-07-05",345937.4,6299054.7000000002,"ZONA PAGA V285"]
[1,"Eliminada","ZPM",342,"RM-0914","PB1576","-","T-4-19-NS-100","-","RECOLETA","Parada 1 / Recoleta   Franciscana","U5","-","-","-","-","-","15:00:00","20:30:00","-","-","-","-","-","-","-","-","-","-","502R","503R",null,null,null,null,null,null,null,null,null,null,null,null,null,null,null,null,null,null,null,null,4,"2017-07-31",346744.24,6299558.2000000002,"ZONA PAGA V286"]
[1,"Activa","ZP",343,"RM-0915","PJ96","-","L-9-7-63-PO","-","LO PRADO","Parada 5 / (M) Pajaritos","U5","-","-","-","-","-","06:00:00","14:00:00","-","-","07:00:00","15:00:00","-","-","-","-","-","-","510I","516I","J06R","J11R","J12I","J17I",null,null,null,null,null,null,null,null,null,null,null,null,null,null,null,2,3,"2017-07-31",340430.44,6296729.9900000002,"ZONA PAGA V286"]
[1,"Suspendida ","ZP",344,"RM-0916","PI230","-","E-13-54-SN-5","-","MAIPÚ","Parada 2 / (M) Plaza   de Maipú","U5","-","-","-","-","-","06:30:00","21:00:00","-","-","06:30:00","21:00:00","-","-","-","-","-","-","506I","506eI","506vI","546eI",null,null,null,null,null,null,null,null,null,null,null,null,null,null,null,null,null,2,"-","2017-07-31",336793.95,6290795.9400000004,"ZONA PAGA V286"]
[1,"Eliminada","ZP COMPARTIDA",345,"RM-0917","PH29","-","E-21-89-OP-35","-","SAN JOAQUÍN","Parada 2 / Departamental   Santa Rosa","U4","U7","-","-","-","-","06:30:00","11:00:00","16:00:00","20:30:00","-","-","-","-","-","-","-","-","102R","107R","108R",null,null,null,null,null,null,null,null,null,null,null,null,null,null,null,null,null,null,null,"-","2017-07-31",347870.74,6291305.2599999998,"ZONA PAGA V286"]
[1,"Eliminada","ZP",346,"RM-0918","PJ149","-","E-9-71-OP-33","-","LO PRADO","Parada 7 / (M) San Pablo","U4","-","-","-","-","-","06:30:00","11:00:00","-","-","-","-","-","-","-","-","-","-","402R","406R","407R","422R","426R","486I","422cR",null,null,null,null,null,null,null,null,null,null,null,null,null,null,null,"-","2017-07-31",339764.44,6298136.2300000004,"ZONA PAGA V288"]
[1,"Activa","ZP COMPARTIDA",348,"RM-0920","PI866","-","L-13-18-20-OP","-","MAIPÚ","Chacabuco esq. / Manuel Rodríguez","U3","U7","-","-","-","-","15:00:00","21:30:00","-","-","-","-","-","-","-","-","-","-","421R","I09R","I09cR",null,null,null,null,null,null,null,null,null,null,null,null,null,null,null,null,null,null,2,"-","2017-08-10",336548.54,6290896.0999999996,"ZONA PAGA V290"]
[1,"Activa","ZP",349,"RM-0921","PE1304","-","L-33-80-10-PO","-","LA FLORIDA","Parada 3 / (M) Vicuña   Mackenna","U3","-","-","-","-","-","15:00:00","22:00:00","-","-","-","-","-","-","-","-","-","-","322I","323I","E07I","E08R","E13R","E14R","E15cR","E18R","D13I",null,null,null,null,null,null,null,null,null,null,null,null,2,"-","2017-08-22",351702.14,6289997.9400000004,"ZONA PAGA V290"]
[1,"Activa","ZP",350,"RM-0922","PJ1604","-","T-10-71-OP-4","-","PUDAHUEL","Parada 6 / (M) Pudahuel","U5","-","-","-","-","-","06:30:00","20:00:00","-","-","07:00:00","20:00:00","-","-","-","-","-","-","511R","J07I","J07cI","J07eI","J15cR","J20I",null,null,null,null,null,null,null,null,null,null,null,null,null,null,null,3,4,"2017-08-30",338110.93,6298072.3300000001,"ZONA PAGA V290"]
[1,"Eliminada","ZP",351,"RM-0923","PI1813","-","T-7-53-PO-87","-","ESTACIÓN CENTRAL","Parada 7 / (M) Estación Central","U4","-","-","-","-","-","06:30:00","11:00:00","17:00:00","20:30:00","-","-","-","-","-","-","-","-","401I","405I","407I","412I","418I","421I","106I",null,null,null,null,null,null,null,null,null,null,null,null,null,null,null,"-","2017-09-01",343975.59,6297450.0999999996,"ZONA PAGA V291"]
[1,"Activa","ZP COMPARTIDA",352,"RM-0924","PD410","-","E-18-157-PO-90","-","ÑUÑOA","Parada 3 / (M) Plaza Egaña","U4","U5","U2","-","-","-","16:00:00","20:30:00","-","-","-","-","-","-","-","-","-","-","403I","422I","D03I","D09R","505I","513I","227R","D15I",null,null,null,null,null,null,null,null,null,null,null,null,null,3,"-","2017-09-01",353978.73,6297316.4800000004,"ZONA PAGA V291"]
[1,"Activa","ZP COMPARTIDA",353,"RM-0925","PD590","PD530","T-18-156-PO-37","T-18-156-PO-35","ÑUÑOA","Parada 1 y 3 / Pedagógico","U5","U3","-","-","-","-","06:00:00","22:00:00","-","-","06:30:00","21:00:00","-","-","-","-","-","-","506I","507I","508I","510I","511I","516I","506eI","506vI","507cI","519I","325R",null,null,null,null,null,null,null,null,null,null,2,"-","2017-09-05",351592.54,6296052.96,"ZONA PAGA V294"]
[1,"Activa","ZP COMPARTIDA",354,"RM-0926","PB126","-","T-4-12-PO-12","-","RECOLETA","Parada 13 / (M) Vespucio   Norte","U4","U7","-","-","-","-","06:30:00","11:00:00","16:00:00","20:30:00","-","-","-","-","-","-","-","-","425I","429I","430I","435I","429cI","712R",null,null,null,null,null,null,null,null,null,null,null,null,null,null,null,2,"-","2017-10-03",346791.52,6305341.8600000003,"ZONA PAGA V295"]
[1,"Activa","ZPF COMPARTIDA",355,"RM-0927","PE1282","-","I-33-134-SN-67","-","LA FLORIDA","Parada  / Est. Intermodal   de La Florida","U3","U7","-","-","-","-","06:00:00","21:30:00","-","-","06:00:00","23:00:00","-","-","08:00:00","23:00:00","-","-","322I","323I","E05R","E06I","E07I","E08R","E13R","E14R","E15cR","E17I","E18R","F25R","F25eR","D13I",null,null,null,null,null,null,null,4,1,"2011-12-22",351553.5,6290027.2999999998,"ZONA PAGA V295"]
[1,"Suspendida ","ZP COMPARTIDA",356,"RM-0928","PI1814","-","T-7-53-PO-89","-","ESTACIÓN CENTRAL","Parada 6 / (M) Estación Central","U2","U5","U7","U3","-","-","06:30:00","21:00:00","-","-","08:00:00","16.00","-","-","-","-","-","-","210I","210vI","221eR","385I","404I","419I","423I","511I","516I","424I","481R",null,null,null,null,null,null,null,null,null,null,2,"-","2017-10-10",344035.91,6297464.7599999998,"ZONA PAGA V295"]
[1,"Activa","ZP",357,"RM-0929","PB864","-","L-4-2-5-OP","-","RECOLETA","Artesanos esq. / Avenida La Paz","U6","-","-","-","-","-","06:30:00","21:00:00","-","-","-","-","-","-","-","-","-","-","B02R","B04R","B23R","B24R","B15I",null,null,null,null,null,null,null,null,null,null,null,null,null,null,null,null,2,4,"2017-10-18",346492.45,6299690.7999999998,"ZONA PAGA V297"]
[1,"Eliminada","ZP COMPARTIDA",358,"RM-0930","PI181","-","T-12-55-NS-15","-","CERRILLOS","Parada 1 / (M) Cerrillos","U5","U4","U3","-","-","-","06:00:00","21:30:00","-","-","06:30:00","21:00:00","-","-","-","-","-","-","108R","109I","113R","115R","113cR",null,null,null,null,null,null,null,null,null,null,null,null,null,null,null,null,null,3,"2017-11-07",342406.92,6293765.5800000001,"ZONA PAGA V301"]
[1,"Activa","ZP",359,"RM-0931","PB756","-","L-4-30-10-OP","-","RECOLETA","Parada 4 / (M) Cerro Blanco","U6","-","-","-","-","-","06:30:00","21:30:00","-","-","-","-","-","-","-","-","-","-","B03R","B25I","B10R",null,null,null,null,null,null,null,null,null,null,null,null,null,null,null,null,null,null,2,5,"2017-11-15",347044.18,6300728.3099999996,"ZONA PAGA V302"]
[1,"Suspendida ","ZP COMPARTIDA",360,"RM-0932","PB544","-","L-6-21-35-SN","-","QUILICURA","Lib. Bdo. O'Higgins esq. / Pichidegua","U3","U6","-","-","-","-","06:00:00","10:00:00","-","-","-","-","-","-","-","-","-","-","307I","307eI","315eI","B12R","307cI","B12cI",null,null,null,null,null,null,null,null,null,null,null,null,null,null,null,1,"-","2017-11-20",339119.62,6307922.8300000001,"ZONA PAGA V303"]
[1,"Eliminada","ZPM",361,"RM-0934","PD357","-","T-19-170-NS-5","-","LA REINA","Parada 5 / (M) Príncipe   de Gales","U4","-","-","-","-","-","06:30:00","10:00:00","17:00:00","21:00:00","-","-","-","-","-","-","-","-","412I","418I","425I","429I","420eI","D15R","D18R",null,null,null,null,null,null,null,null,null,null,null,null,null,null,null,4,"2018-01-25",353843.58,6298905.8899999997,"ZONA PAGA V303"]
[1,"Eliminada","ZP",362,"RM-0935","PH4","-","T-28-89-PO-15","-","PEDRO AGUIRRE CERDA","Av. Departamental esq. / Av. Clotario Blest","U1","-","-","-","-","-","06:30:00","10:30:00","-","-","-","-","-","-","-","-","-","-","102I","107I","108I",null,null,null,null,null,null,null,null,null,null,null,null,null,null,null,null,null,null,null,4,"2018-01-25",344226.19,6292694.8399999999,"ZONA PAGA V303"]
[1,"Eliminada","ZP",363,"RM-0936","PJ79","-","T-10-78-PO-15","-","PUDAHUEL","Parada 1 / Oceanía   Laguna Sur","U1","-","-","-","-","-","06:30:00","10:30:00","-","-","-","-","-","-","-","-","-","-","110R","111R","110cR",null,null,null,null,null,null,null,null,null,null,null,null,null,null,null,null,null,null,null,4,"2017-12-01",336769.63,6296402.3700000001,"ZONA PAGA V303"]
[1,"Eliminada","ZP",364,"RM-0937","PH6","-","T-28-89-PO-25","-","PEDRO AGUIRRE CERDA","Av. Departamental esq. / Club Hípico ","U1","-","-","-","-","-","06:30:00","10:30:00","-","-","-","-","-","-","-","-","-","-","102I","107I","108I",null,null,null,null,null,null,null,null,null,null,null,null,null,null,null,null,null,null,null,4,"2018-01-25",344676.08,6292309.54,"ZONA PAGA V303"]
[1,"Eliminada","ZP COMPARTIDA",365,"RM-0938","PA16","-","E-20-53-OP-130","-","SANTIAGO","Parada 2 / (M) Estación Central","U5","U4","U3","U2","U6",null,"06:30:00","21:30:00","-","-","07:30:00"," 21:00","-","-","-","-","-","-","109R","210R","210vR","221eI","385R","407R","412R","418R","507R","511R","513R","J16I","B28I",null,null,null,null,null,null,null,null,null,5,"2017-12-07",344000.68,6297510.9500000002,"ZONA PAGA V304"]
[1,"Eliminada","ZP COMPARTIDA",366,"RM-0939","PA367","-","E-20-53-OP-125","-","SANTIAGO","Parada 3 / (M) Estación Central","U5","U3","U4","-","-","-","06:30:00","21:30:00","-","-","07:30:00"," 21:00","-","-","-","-","-","-","I09R","I09eR","I14R","404R","510R","516R","J10R","J13I","424R","481I",null,null,null,null,null,null,null,null,null,null,null,null,5,"2017-12-07",344099.93,6297543.5300000003,"ZONA PAGA V304"]
[1,"Eliminada","ZP COMPARTIDA",367,"RM-0940","PA368","-","E-20-53-PO-5","-","SANTIAGO","Parada 4 / (M) Estación Central","U5","U4","-","-","-","-","06:30:00","21:30:00","-","-","07:30:00"," 21:00","-","-","-","-","-","-","406I","422I","426I","507I","510I","513I",null,null,null,null,null,null,null,null,null,null,null,null,null,null,null,null,6,"2017-12-07",344122.81,6297496.8399999999,"ZONA PAGA V304"]
[1,"Eliminada","ZP COMPARTIDA",368,"RM-0941","PI449","-","E-7-53-OP-35","-","ESTACIÓN CENTRAL","Parada 6 / (M) San Alberto Hurtado","U5","U4","U2","U3","-","-","14:00:00","21:30:00","-","-","07:30:00"," 21:00","-","-","-","-","-","-","210R","210vR","I09R","I09eR","404R","412R","418R","510R","511R","516R","J10R","J13I","424R","481I",null,null,null,null,null,null,null,null,4,"2017-12-07",342745.65,6297106.1600000001,"ZONA PAGA V304"]
[1,"Eliminada","ZP COMPARTIDA",369,"-","PF89","-","T-34-270-NS-75","-","PUENTE ALTO","Av. Concha y Toro esq. / Av. Eyzaguirre","U7","U2","-","-","-","-","12:00:00","21:00:00","-","-","12:00:00"," 17:00","-","-","-","-","-","-","205I","210I","F01I","F03I","F03cI","F10R","F11R","F13R","F14I","F16I","F29I","F29I","F29I",null,null,null,null,null,null,null,null,null,"-","2017-12-11",353837.38,6279764.6399999997,"ZONA PAGA V304"]
[1,"Eliminada","ZP COMPARTIDA",370,"-","PF93","-","T-34-236-SN-3","-","PUENTE ALTO","Balmaceda esq. / Av. Eyzaguirre","U7","U2","-","-","-","-","12:30:00","21:00:00","-","-","-","-","-","-","-","-","-","-","205R","210R","F01I","F01cI","F12I","F12cI","F14R","F29I","712I",null,null,null,null,null,null,null,null,null,null,null,null,null,"-","2017-12-11",353956.96,6279686.9900000002,"ZONA PAGA V304"]
[1,"Activa","ZP",371,"RM-0944","PF176","-","E-34-270-NS-70","-","PUENTE ALTO","Parada 3 / (M) Plaza de   Puente Alto","U7","-","-","-","-","-","06:30:00","22:30:00","-","-","-","-","-","-","-","-","-","-","F03I","F03cI","F10R","F13R","F13cR","F10cI","213eI","F16I",null,null,null,null,null,null,null,null,null,null,null,null,null,4,5,"2017-12-11",353788.28,6280015.0499999998,"ZONA PAGA V304"]
[1,"Activa","ZP",372,"RM-0945","PF310","-","L-34-41-5-OP","-","PUENTE ALTO","Parada 6 / Hospital de Niños","U7","-","-","-","-","-","13:00:00","21:30:00","-","-","-","-","-","-","-","-","-","-","F05R","F06R","F08R","F14R","F20R","F24I","F27R",null,null,null,null,null,null,null,null,null,null,null,null,null,null,2,3,"2017-12-11",353144.2,6283962.8200000003,"ZONA PAGA V304"]
[1,"Activa","ZP",373,"RM-0946","PI953","-","L-13-15-110-PO","-","MAIPÚ","Camino a Rinconada esq. / La Galaxia","U3","-","-","-","-","-","06:30:00","10:00:00","-","-","-","-","-","-","-","-","-","-","I05I","I07I","I09I","I09cI","I24I","I11R",null,null,null,null,null,null,null,null,null,null,null,null,null,null,null,1,"-","2017-12-13",333171.42,6291067.3399999999,"ZONA PAGA V305"]
[1,"Activa","ZP",374,"RM-0947","PI954","-","L-13-15-120-PO","-","MAIPÚ","Camino a Rinconada esq. / Batallón Atacama","U3","-","-","-","-","-","06:30:00","10:00:00","-","-","-","-","-","-","-","-","-","-","I05I","I09I","I09cI","I09eI","I24I","I11R",null,null,null,null,null,null,null,null,null,null,null,null,null,null,null,1,"-","2017-12-13",333426.84999999998,6291159.6100000003,"ZONA PAGA V305"]
[1,"Activa","ZP COMPARTIDA",375,"RM-0948","PI1493","-","L-13-15-125-PO","-","MAIPÚ","Camino a Rinconada esq. / Pasaje Santo Padre","U3","U5","-","-","-","-","06:30:00","10:00:00","-","-","-","-","-","-","-","-","-","-","109R","I11R","350cI","I05I","I09I","I09cI","I09eI","I24I",null,null,null,null,null,null,null,null,null,null,null,null,null,1,"-","2017-12-13",333660.38,6291239.5099999998,"ZONA PAGA V305"]
[1,"Suspendida ","ZP COMPARTIDA",376,"RM-0949","PI198","-","T-13-94-PO-10","-","MAIPÚ","Camino a Rinconada esq. / Quinta Vergara","U3","U5","-","-","-","-","06:30:00","10:00:00","-","-","-","-","-","-","-","-","-","-","109R","350R","350cI","I05I","I09cI","I09eI","I09I","I24I",null,null,null,null,null,null,null,null,null,null,null,null,null,1,"-","2017-12-13",333904.42,6291233.0499999998,"ZONA PAGA V305"]
[1,"Activa","ZP COMPARTIDA",377,"RM-0950","PI200","-","T-13-94-PO-20","-","MAIPÚ","Camino a Rinconada esq. / Los Adobes","U3","U5","-","-","-","-","06:30:00","12:00:00","-","-","-","-","-","-","-","-","-","-","109R","I11R","350cI","I05I","I09cI","I09I","I24I",null,null,null,null,null,null,null,null,null,null,null,null,null,null,2,"-","2017-12-13",334465.82,6291003.7000000002,"ZONA PAGA V305"]
[1,"Activa","ZP COMPARTIDA",378,"RM-0951","PI1792","-","T-13-94-PO-33","-","MAIPÚ","Parada 4 / Hospital Maipú","U3","U7","U5","-","-","-","06:30:00","12:00:00","-","-","-","-","-","-","-","-","-","-","108I","348I","I11R","350cI","I05I","I09I","I09cI","I18I","I24I","109R","118I",null,null,null,null,null,null,null,null,null,null,2,"-","2017-12-13",335285.7,6290856.5,"ZONA PAGA V305"]
[1,"Suspendida ","ZP",379,"RM-0952","PG1745","-","L-30-51-95-NS","-","SAN BERNARDO","Parada 2 / Est. Nos","U2","-","-","-","-","-","17:00:00","21:00:00","-","-","-","-","-","-","-","-","-","-","211I","G02I","G07I",null,null,null,null,null,null,null,null,null,null,null,null,null,null,null,null,null,null,2,"-","2017-12-19",341792.17,6277201.5899999999,"ZONA PAGA V306"]
[1,"Eliminada","ZP",380,"RM-0953","PC563","-","T-14-130-NS-5","-","PROVIDENCIA","Parada 5 / (M) Salvador","U5","-","-","-","-","-","10:00:00","21:30:00","-","-","-","-","-","-","-","-","-","-","505I","508I","514I","514cI",null,null,null,null,null,null,null,null,null,null,null,null,null,null,null,null,null,null,4,"2017-12-19",348830.34,6299326.1399999997,"ZONA PAGA V306"]
[1,"Activa","ZP",381,"RM-0954","PF212","-","L-34-44-6-PO","-","PUENTE ALTO","Parada 5 / (M) Plaza de   Puente Alto","U7","-","-","-","-","-","11:00:00","20:30:00","-","-","-","-","-","-","-","-","-","-","F12R","F12cR","F18R",null,null,null,null,null,null,null,null,null,null,null,null,null,null,null,null,null,null,3,3,"2017-12-22",353962.59,6280072.6900000004,"ZONA PAGA V306"]
[1,"Activa","ZP",382,"RM-0955","PF512","-","E-34-294-PO-5","-","PUENTE ALTO","Parada 2 / (M) Plaza de   Puente Alto","U7","-","-","-","-","-","11:00:00","21:00:00","-","-","-","-","-","-","-","-","-","-","F03R","F03cR","F10I","F13I","712I","F14R","F10cI",null,null,null,null,null,null,null,null,null,null,null,null,null,null,4,4,"2017-12-22",353937.33,6280067.8499999996,"ZONA PAGA V306"]
[1,"Eliminada","ZPM",383,"RM-0960","PI437","-","E-7-53-PO-10","-","ESTACIÓN CENTRAL","Parada 5 / (M) Las Rejas","U4","-","-","-","-","-","06:30:00","11:00:00","-","-","-","-","-","-","-","-","-","-","404cI","413cI","431cI",null,null,null,null,null,null,null,null,null,null,null,null,null,null,null,null,null,null,null,3,"2018-01-05",341342.11,6296646.1900000004,"ZONA PAGA V309"]
[1,"Eliminada","ZP COMPARTIDA",384,"RM-0961","PI1375","-","T-12-89-PO-3","-","CERRILLOS","Parada 3 / (M) Cerrillos","U4","U7","-","-","-","-","06:30:00","11:00:00","16:00:00","20:30:00","-","-","-","-","-","-","-","-","102I","107I","108I",null,null,null,null,null,null,null,null,null,null,null,null,null,null,null,null,null,null,null,3,"2018-01-05",342550.67,6293786.4699999997,"ZONA PAGA V309"]
[1,"Activa","ZP COMPARTIDA",385,"RM-0962","PB121","-","T-3-12-OP-30","-","HUECHURABA","Parada 11 / (M) Vespucio   Norte","U4","U6","U7","-","-","-","06:30:00","11:00:00","16:00:00","20:30:00","-","-","-","-","-","-","-","-","425R","429R","429cR","430R","435R","117R","B05R","712I",null,null,null,null,null,null,null,null,null,null,null,null,null,2,4,"2018-01-05",347074.69,6305270.3099999996,"ZONA PAGA V309"]
[1,"Activa","ZP",386,"RM-0963","PF3","-","T-34-269-NS-20","-","PUENTE ALTO","Parada 1 / Mall   Plaza Tobalaba","U7","-","-","-","-","-","12:00:00","22:30:00","-","-","12:00:00"," 22:30","-","-","-","-","-","-","102I","104I","114I","F07R","F08R","F19I","712R",null,null,null,null,null,null,null,null,null,null,null,null,null,null,2,4,"2018-01-08",355682.11,6284530.9699999997,"ZONA PAGA V309"]
[1,"Eliminada","ZP COMPARTIDA",387,"RM-0966","PB1880","-","T-5-30-PO-6","-","RENCA","Parada 5 / Plaza Renca","U1","U6","-","-","-","-","06:30:00","11:00:00","-","-","-","-","-","-","-","-","-","-","105I","109I","120I","B09I",null,null,null,null,null,null,null,null,null,null,null,null,null,null,null,null,null,null,4,"2018-03-14",341328.38,6302573.1399999997,"ZONA PAGA V315"]
[1,"Activa","ZP COMPARTIDA",388,"RM-0967","PB517","-","T-3-12-OP-70","-","HUECHURABA","Parada  / Mall Plaza Norte","U6","U4","-","-","-","-","-","-","12:30:00","21:30:00","-","-","-","-","-","-","-","-","425R","429R","429cR","B08R","B13I","B18R",null,null,null,null,null,null,null,null,null,null,null,null,null,null,null,2,4,"2018-02-26",343792.35,6306682.3899999997,"ZONA PAGA V316"]
[1,"Activa","ZP",389,"RM-0968","PB1640","-","L-5-28-3-PO","-","RENCA","Calle 2 esq. / Secundaria","U6","-","-","-","-","-","-","-","12:00:00","21:00:00","-","-","-","-","-","-","-","-","B20I",null,null,null,null,null,null,null,null,null,null,null,null,null,null,null,null,null,null,null,null,2,2,"2018-02-26",335887.34,6303975.2699999996,"ZONA PAGA V316"]
[1,"Activa","ZP COMPARTIDA",390,"RM-0969","PA665","-","T-20-304-SN-1","-","SANTIAGO","Parada 11 / (M) La Moneda","U3","U5","-","-","-","-","06:30:00","21:30:00","-","-","-","-","-","-","-","-","-","-","301R","509I",null,null,null,null,null,null,null,null,null,null,null,null,null,null,null,null,null,null,null,2,4,"2018-03-01",346127.84,6298157.8700000001,"ZONA PAGA V316"]
[1,"Eliminada","ZP COMPARTIDA",391,"RM-0970","PI58","-","T-12-89-OP-10","-","CERRILLOS","Parada 6 / (M) Cerrillos","U4","U7","U3","-","-","-","16:30:00","20:30:00","-","-","-","-","-","-","-","-","-","-","102R","107R","I25I",null,null,null,null,null,null,null,null,null,null,null,null,null,null,null,null,null,null,null,2,"2018-05-22",342523.14,6293825.5999999996,"ZONA PAGA V317"]
[1,"Activa","ZP COMPARTIDA",392,"RM-0971","PF758","-","T-34-270-NS-8","-","PUENTE ALTO","Parada 1 / (M) Hospital   Sótero del Río","U7","U2","-","-","-","-","12:00:00","20:30:00","-","-","-","-","-","-","-","-","-","-","F13R","F15R","210I","221eR","213eI",null,null,null,null,null,null,null,null,null,null,null,null,null,null,null,null,1,4,"2018-03-22",353139.93,6283725.5099999998,"ZONA PAGA V317"]
[1,"Activa","ZP",393,"RM-0972","PF460","-","T-34-270-NS-50","-","PUENTE ALTO","Parada 1 / (M) Las Mercedes","U7","-","-","-","-","-","06:00:00","22:30:00","-","-","-","-","-","-","-","-","-","-","F01I","F10R","F13R","F15R","F16I","F19I","F25R","F29I","F10cI",null,null,null,null,null,null,null,null,null,null,null,null,3,5,"2018-03-22",353632.65,6280887.3099999996,"ZONA PAGA V317"]
[1,"Activa","ZP COMPARTIDA",394,"RM-0973","PF759","-","T-34-270-SN-47","-","PUENTE ALTO","Parada 4 / (M) Hospital   Sótero del Río","U7","U2","-","-","-","-","06:00:00","14:30:00","-","-","-","-","-","-","-","-","-","-","210R","221eI","213eR",null,null,null,null,null,null,null,null,null,null,null,null,null,null,null,null,null,null,1,3,"2018-03-22",353166.83,6283629.6500000004,"ZONA PAGA V317"]
[1,"Activa","ZP COMPARTIDA",395,"RM-0974","PF311","-","T-34-270-NS-10","-","PUENTE ALTO","Parada 3 / (M) Hospital   Sótero del Río","U7","U3","-","-","-","-","06:00:00","22:30:00","-","-","-","-","-","-","-","-","-","-","E16R","F05R","F06R","F08R","F14R","F20R","F27R",null,null,null,null,null,null,null,null,null,null,null,null,null,null,3,5,"2018-03-22",353125.41,6283612.2699999996,"ZONA PAGA V317"]
[1,"Activa","ZP",396,"RM-0975","PF272","-","T-34-270-SN-45","-","PUENTE ALTO","Parada 2 / (M) Hospital   Sótero del Río","U7","-","-","-","-","-","06:00:00","23:00:00","-","-","-","-","-","-","-","-","-","-","F05I","F06I","F08I","F14I","F20I","F27I",null,null,null,null,null,null,null,null,null,null,null,null,null,null,null,4,5,"2018-03-22",353177.99,6283634.7000000002,"ZONA PAGA V317"]
[1,"Eliminada","ZP COMPARTIDA",397,"RM-0976","PJ1586","-","E-9-299-SN-5","-","LO PRADO","Parada 10 / (M) San Pablo","U5","U4","-","-","-","-","06:30:00","22:00:00","-","-","-","-","-","-","-","-","-","-","J01I","J08I","511R","412R",null,null,null,null,null,null,null,null,null,null,null,null,null,null,null,null,null,null,"-","2018-03-26",339858.91,6298054.54,"ZONA PAGA V317"]
[1,"Eliminada","ZP COMPARTIDA",398,"RM-0977","PA551","-","T-20-53-OP-120","-","SANTIAGO","Parada 2 / (M) Unión   Latinoamericana","U5","U3","-","-","-","-","06:30:00","21:30:00","-","-","07:00:00","21:00:00","-","-","-","-","-","-","510R","516R","J02I","J05I","345R",null,null,null,null,null,null,null,null,null,null,null,null,null,null,null,null,null,"-","2018-03-26",344307.4,6297613.1299999999,"ZONA PAGA V317"]
[1,"Activa","ZP",399,"RM-0978","PF965","-","L-34-89-2-PO","-","PUENTE ALTO","La Primavera esq. / Charwa","U7","-","-","-","-","-","05:30:00","13:00:00","-","-","-","-","-","-","-","-","-","-","F01I","F07R","F08I","F14I","F16I","F26R","F27I",null,null,null,null,null,null,null,null,null,null,null,null,null,null,2,3,"2018-05-14",351337.97,6281742.5999999996,"ZONA PAGA V325"]
[1,"Eliminada","ZP COMPARTIDA",400,"RM-0979","PF467","-","L-34-46-16-SN","-","PUENTE ALTO","Avenida Juanita esq. / Weber","U7","U2","-","-","-","-","05:30:00","13:00:00","-","-","-","-","-","-","-","-","-","-","F10I","F12I","F12cI","F13I","F13cI","F15I","F18I","F25I","F25eI","209R","209eR",null,null,null,null,null,null,null,null,null,null,null,3,"2018-05-14",350490.2,6277798.5199999996,"ZONA PAGA V326"]
[1,"Activa","ZP",401,"RM-0981","PG369","-","T-30-244-SN-5","-","SAN BERNARDO","Camino Padre Hurtado esq. / Pirineos","U3","-","-","-","-","-","06:30:00","10:00:00","-","-","-","-","-","-","-","-","-","-","301R","301cR",null,null,null,null,null,null,null,null,null,null,null,null,null,null,null,null,null,null,null,2,"-","2018-06-11",344104.17,6281399.79,"ZONA PAGA V326"]
[1,"Activa","ZP COMPARTIDA",402,"RM-0982","PG370","-","T-30-244-SN-10","-","SAN BERNARDO","Camino Padre Hurtado esq. / Av. A. Vespucio","U3","U2","-","-","-","-","06:30:00","10:00:00","-","-","-","-","-","-","-","-","-","-","301R","301cR","G14R",null,null,null,null,null,null,null,null,null,null,null,null,null,null,null,null,null,null,2,"-","2018-06-11",344158.79,6281672.9299999997,"ZONA PAGA V326"]
[1,"Activa","ZP COMPARTIDA",403,"RM-0983","PG371","-","T-30-244-SN-15","-","SAN BERNARDO","Camino Padre Hurtado esq. / Quetrupillán","U3","U2","-","-","-","-","06:30:00","10:00:00","-","-","-","-","-","-","-","-","-","-","301R","301cR","G14R","G08I","228R",null,null,null,null,null,null,null,null,null,null,null,null,null,null,null,null,2,"-","2018-06-11",344222.62,6281982.9199999999,"ZONA PAGA V326"]
[1,"Suspendida ","ZP COMPARTIDA",404,"RM-0984","PG373","-","T-30-244-SN-20","-","SAN BERNARDO","Camino Padre Hurtado esq. / Santa Ana","U3","U2","-","-","-","-","06:30:00","10:00:00","-","-","-","-","-","-","-","-","-","-","301R","301cR","G14R",null,null,null,null,null,null,null,null,null,null,null,null,null,null,null,null,null,null,1,"-","2018-06-11",344304.06,6282395.71,"ZONA PAGA V326"]
[1,"Activa","ZP COMPARTIDA",405,"RM-0985","PG374","-","T-30-244-SN-25","-","SAN BERNARDO","Parada  / Hospital El Pino","U3","U2","-","-","-","-","06:30:00","10:00:00","-","-","-","-","-","-","-","-","-","-","301R","301cR","G14R","G08vI",null,null,null,null,null,null,null,null,null,null,null,null,null,null,null,null,null,2,"-","2018-06-11",344376.16,6282736.0800000001,"ZONA PAGA V326"]
[1,"Activa","ZP COMPARTIDA",406,"RM-0986","PG375","-","T-27-230-SN-5","-","EL BOSQUE","Av. Padre Hurtado esq. / Volcán Llullaillaco","U3","U2","-","-","-","-","06:30:00","10:00:00","-","-","-","-","-","-","-","-","-","-","301R","301cR","301c2R","G07R","G16R",null,null,null,null,null,null,null,null,null,null,null,null,null,null,null,null,2,"-","2018-06-11",344425.87,6282949.9800000004,"ZONA PAGA V326"]
[1,"Activa","ZP COMPARTIDA",407,"RM-0987","PG377","-","T-27-230-SN-15","-","EL BOSQUE","Av. Padre Hurtado esq. / Madrid","U3","U2","-","-","-","-","06:30:00","10:00:00","-","-","-","-","-","-","-","-","-","-","301R","301cR","301c2R","G16R",null,null,null,null,null,null,null,null,null,null,null,null,null,null,null,null,null,2,"-","2018-06-11",344555.88,6283526.6399999997,"ZONA PAGA V326"]
[1,"Suspendida ","ZP",408,"RM-0988","PB1876","-","L-6-52-3-OP","-","QUILICURA","Parada  / Alto de La Campiña","U6","-","-","-","-","-","06:30:00","10:00:00","-","-","-","-","-","-","-","-","-","-","B18I","B18eI",null,null,null,null,null,null,null,null,null,null,null,null,null,null,null,null,null,null,null,2,3,"2018-06-20",339564.39,6305266.4699999997,"ZONA PAGA V332"]
[1,"Suspendida ","ZP COMPARTIDA",409,"RM-0989","PB547","-","L-6-2-20-PO","-","QUILICURA","Antumalal esq. / Avenida Lo Cruzat","U3","U6","-","-","-","-","06:30:00","10:00:00","-","-","-","-","-","-","-","-","-","-","307I","307eI","313eR","315eI","307cI","B13R",null,null,null,null,null,null,null,null,null,null,null,null,null,null,null,2,"-","2018-07-03",339869.56,6308081.3300000001,"ZONA PAGA V335"]
[1,"Activa","ZP COMPARTIDA",410,"RM-0990","PG61","-","T-26-228-SN-20","-","LA CISTERNA","Parada 5 / (M) La Cisterna","U3","U2","-","-","-","-","11:00:00","20:30:00","-","-","-","-","-","-","-","-","-","-","201R","223R","G18I","271R","301R",null,null,null,null,null,null,null,null,null,null,null,null,null,null,null,null,2,"-","2018-07-20",345444.50069999998,6287691.4820999997,"ZONA PAGA V369"]
[1,"Activa","ZP COMPARTIDA",411,"RM-0991","PA215","-","E-20-53-PO-70","-","SANTIAGO","Parada 5 / (M) La Moneda","U3","U2","U4","U5","-","-","06:30:00","21:30:00","-","-","-","-","-","-","-","-","-","-","210I","229I","210vI","301I","385I","403I","422I","513I","516I","519I","I09I","I09eI","223I","345I",null,null,null,null,null,null,null,2,"-","2018-07-20",346225.95,6298139.6900000004,"ZONA PAGA V337"]
[1,"Activa","ZP COMPARTIDA",412,"RM-0992","PA48","-","E-20-174-NS-5","-","SANTIAGO","Parada 1 / Estación Mapocho","U3","U2","-","-","-","-","06:30:00","20:30:00","-","-","-","-","-","-","-","-","-","-","301I","201I",null,null,null,null,null,null,null,null,null,null,null,null,null,null,null,null,null,null,null,2,"-","2018-07-20",346301.59,6299532.0199999996,"ZONA PAGA V337"]
[1,"Eliminada","ZP COMPARTIDA",413,"RM-0993","PH127","-","E-25-228-SN-16","-","SAN MIGUEL","Parada 2 / (M) Departamental","U3","U2","-","-","-","-","06:30:00","12:00:00","-","-","-","-","-","-","-","-","-","-","301R","H05R","H14I","201R","214I","223R","226R","229R","271R",null,null,null,null,null,null,null,null,null,null,null,null,null,"-","2018-07-20",346282.37,6291623.1200000001,"ZONA PAGA V337"]
[1,"Suspendida ","ZP COMPARTIDA",414,"RM-0994","PD115","PD528","T-18-156-PO-27","T-18-156-PO-25","ÑUÑOA","Parada 1 y Parada 3/ (M) Est.Nacional","U5","U7","U3","-","-","-","06:00:00","21:00:00","-","-","-","-","-","-","-","-","-","-","506I","507I","510I","511I","516I","506eI","506vI","507cI","519I","106I","126I","508I",null,null,null,null,null,null,null,null,null,3,3,"2018-07-20",350489.51,6296320.9000000004,"ZONA PAGA V337"]
[1,"Activa","ZP COMPARTIDA",415,"RM-0995","PB683","-","E-4-296-OP-5","-","RECOLETA","Parada 1 / (M) Zapadores","U6","U7","U2","-","-","-","06:30:00","21:30:00","-","-","-","-","-","-","-","-","-","-","272R","B01I","B19R","B22I","712R",null,null,null,null,null,null,null,null,null,null,null,null,null,null,null,null,2,"-","2018-10-03",347200.85628873698,6304201.1234837295,"ZONA PAGA V349"]
[1,"Activa","ZP",416,"RM-0996","PB1283","-","E-4-295-PO-5","-","RECOLETA","Parada 3 / (M) Einstein","U6","-","-","-","-","-","06:30:00","21:30:00","-","-","-","-","-","-","-","-","-","-","B14R","B21I",null,null,null,null,null,null,null,null,null,null,null,null,null,null,null,null,null,null,null,2,"-","2018-10-01",347158.37576032098,6302519.1219808701,"ZONA PAGA V350"]
[1,"Eliminada","ZP COMPARTIDA",417,"RM-0997","PA66","-","T-20-200-SN-25","-","SANTIAGO","Parada/ Liceo Barros Borgoño","U3","U2","-","-","-","-","06:30:00","10:00:00","-","-","-","-","-","-","-","-","-","-","301R","H06I","201R","214I","223R","226R","229R","271R",null,null,null,null,null,null,null,null,null,null,null,null,null,null,"-","2018-11-08",346794.7,6295798.0199999996,"ZONA PAGA V350"]
[1,"Eliminada","ZP",418,"RM-0998","PA658","-","T-20-189-PO-15","-","SANTIAGO","Avenida Matta / esq. San Diego","U5","-","-","-","-","-","06:00:00","14:00:00","-","-","-","-","-","-","-","-","-","-","506I","507I","510I","506eI","506vI","507cI",null,null,null,null,null,null,null,null,null,null,null,null,null,null,null,null,"-","2018-10-22",346709.1678,6296523.7002999997,"ZONA PAGA V350"]
[1,"Eliminada","ZP",419,"RM-0999","PA439","-","T-20-189-PO-25","-","SANTIAGO","Avenida Matta / esq. Av. Santa Rosa","U5","-","-","-","-","-","06:00:00","14:00:00","-","-","-","-","-","-","-","-","-","-","506I","507I","510I","506eI","506vI","507cI",null,null,null,null,null,null,null,null,null,null,null,null,null,null,null,null,"-","2018-10-22",347258.92,6296667.3700000001,"ZONA PAGA V350"]
[1,"Eliminada","ZP",420,"RM-1000","PA443","-","T-20-189-OP-5","-","SANTIAGO","Avenida Matta / esq. Avenida Portugal","U5","-","-","-","-","-","14:00:00","22:00:00","-","-","-","-","-","-","-","-","-","-","506R","507R","510R","506vR","507cR",null,null,null,null,null,null,null,null,null,null,null,null,null,null,null,null,null,"-","2018-10-22",348222.14,6296963.7000000002,"ZONA PAGA V350"]
[1,"Eliminada","ZP",421,"RM-1001","PA446","-","T-20-189-OP-20","-","SANTIAGO","Avenida Matta / esq. Av. Santa Rosa","U5","-","-","-","-","-","06:00:00","22:00:00","-","-","-","-","-","-","-","-","-","-","506R","507R","510R","506eR","506vR","507cR",null,null,null,null,null,null,null,null,null,null,null,null,null,null,null,null,"-","2018-10-22",347311.25,6296720.25,"ZONA PAGA V350"]
[1,"Eliminada","ZP",422,"RM-1002","PA448","-","T-20-189-OP-30","-","SANTIAGO","Avenida Matta / esq. San Diego","U5","-","-","-","-","-","06:00:00","22:00:00","-","-","-","-","-","-","-","-","-","-","506R","507R","510R","506eR","506vR","507cR",null,null,null,null,null,null,null,null,null,null,null,null,null,null,null,null,"-","2018-10-22",346770.52,6296575.1900000004,"ZONA PAGA V350"]
[1,"Activa","ZP",423,"RM-1003","PD1387","-","L-31-8-5-PO","-","MACUL","Parada 3 / (M) Camino   Agrícola","U4","-","-","-","-","-","06:30:00","11:00:00","16:00:00","20:30:00","-","-","-","-","-","-","-","-","D07R","D10I","D14I",null,null,null,null,null,null,null,null,null,null,null,null,null,null,null,null,null,null,2,"-","2018-11-07",349794.61,6293048.9400000004,"ZONA PAGA V353"]
[1,"Activa","ZP",424,"RM-1004","PI1396","-","L-13-96-15-PO","-","MAIPÚ","Parada 9 / (M) Plaza de Maipú","U3","-","-","-","-","-","06:30:00","21:30:00","-","-","-","-","-","-","-","-","-","-","I12I","I24I","I11R",null,null,null,null,null,null,null,null,null,null,null,null,null,null,null,null,null,null,2,"-","2018-11-14",336751.16,6290707.6900000004,"ZONA PAGA V354"]
[1,"Eliminada","ZP",425,"RM-1005","PD357","-","T-19-170-NS-5","-","LA REINA","Parada 5 / (M) Príncipe   de Gales","U4","-","-","-","-","-","06:30:00","11:00:00","16:00:00","20:30:00","-","-","-","-","-","-","-","-","412I","418I","425I","429I","420eI","D18R",null,null,null,null,null,null,null,null,null,null,null,null,null,null,null,null,"-","2018-11-26",353843.58,6298905.8899999997,"ZONA PAGA V356"]
[1,"Suspendida ","ZP",426,"RM-1006","PD1359","-","T-32-156-OP-10","-","PEÑALOLÉN","Parada / Municipalidad de Peñalolén","U5","-","-","-","-","-","06:00:00","22:00:00","-","-","06:30:00","21:00:00","-","-","-","-","-","-","506R","507R","511R","506eR","506vR","507cR","519R",null,null,null,null,null,null,null,null,null,null,null,null,null,null,2,"-","2018-12-15",356698.07990000001,6294877.9528999999,"ZONA PAGA V359"]
[1,"Eliminada","ZP",427,"RM-1007","PC290","-","T-17-145-PO-5","-","LAS CONDES","Nueva Las Condes esq. / Sn. Francisco de Asís","U4","-","-","-","-","-","16:00:00","20:30:00","-","-","-","-","-","-","-","-","-","-","405R","406R","409I","426I","430I",null,null,null,null,null,null,null,null,null,null,null,null,null,null,null,null,null,"-","2018-12-27",358827.31280000001,6306288.2723000003,"ZONA PAGA V360"]
[1,"Activa","ZP",428,"RM-1008","PJ69","-","E-10-75-NS-21","-","PUDAHUEL","Parada 3 (M) Pudahuel","U5","-","-","-","-","-","06:30:00","14:00:00","-","-","07:00:00","14:00:00","-","-","-","-","-","-","110I","110cI",null,null,null,null,null,null,null,null,null,null,null,null,null,null,null,null,null,null,null,1,2,"2019-01-30",338204.26539999997,6297971.2863999996,"ZONA PAGA V364"]
[1,"Suspendida ","ZP ",429,"RM-1009","PD582","-","T-18-156-OP-53","-","ÑUÑOA","Parada 2 / (M) Est.Nacional","U5",null,null,"-","-","-","06:00:00","21:00:00","-","-","-","-","-","-","-","-","-","-","506R","507R","510R","516R","506eR","506vR","507cR","519R",null,null,null,null,null,null,null,null,null,null,null,null,null,3,2,"2019-01-30",350598.01,6296321.4400000004,"ZONA PAGA V364"]
[1,"Eliminada","ZP COMPARTIDA",430,"RM-1010","PB1894","-","T-6-7-OP-1","-","QUILICURA","Parada 7 / (M) Los Libertadores","U6","U3","U4","-","-","-","06:30:00","21:30:00","-","-","-","-","-","-","-","-","-","-","308R","B07I","B08R","B11I","B13I","B18R","314cI","428eI",null,null,null,null,null,null,null,null,null,null,null,null,null,null,4,"2019-01-30",342714.7,6306896.4000000004,"ZONA PAGA V365"]
[1,"Eliminada","ZP",431,"RM-1011","PB1895","-","T-3-280-SN-5","-","QUILICURA","Parada 9 / (M) Los Libertadores","U6","-","-","-","-","-","06:30:00","21:30:00","-","-","-","-","-","-","-","-","-","-","B12I",null,null,null,null,null,null,null,null,null,null,null,null,null,null,null,null,null,null,null,null,null,4,"2019-01-31",342868.94,6306900.6900000004,"ZONA PAGA V365"]
[1,"Suspendida ","ZP COMPARTIDA",432,"RM-1012","PC38","-","T-14-125-NS-5","-","PROVIDENCIA","Parada 5 / (M) Manuel Montt","U3","U4","-","-","-","-","16:30:00","20:30:00","-","-","-","-","-","-","-","-","-","-","106I","126I",null,null,null,null,null,null,null,null,null,null,null,null,null,null,null,null,null,null,null,3,3,"2007-10-29",349473.96,6299795.2000000002,"ZONA PAGA V366"]
[1,"Eliminada","ZP COMPARTIDA",433,"RM-1013","PI106","-","E-13-278-PO-15","-","MAIPÚ","Parada 8 / (M) Plaza   de Maipú","U5","U4","-","-","-","-","06:30:00","22:00:00","-","-","07:00:00","21:00:00","-","-","-","-","-","-","108I","109R","118I",null,null,null,null,null,null,null,null,null,null,null,null,null,null,null,null,null,null,null,2,"2019-02-18",336883.69,6290714.9299999997,"ZONA PAGA V367"]
[1,"Suspendida ","ZP COMPARTIDA",434,"RM-1014","PD1444","-","T-31-89-OP-2","-","MACUL","Parada / Estación de Buses (M) Macul -Oriente","U4","U3","U7","-","-","-","06:30:00","11:00:00","16:00:00","20:30:00","-","-","-","-","-","-","-","-","102R","107R","108R","E17R",null,null,null,null,null,null,null,null,null,null,null,null,null,null,null,null,null,2,"-","2019-02-20",352228.75640000001,6291047.0659999996,"ZONA PAGA V368"]
[1,"Eliminada","ZP COMPARTIDA",435,"RM-1015","PE1410","-","T-33-89-PO-32","-","LA FLORIDA","Parada / Estación de Buses (M) Macul -Poniente","U4","U3","U5","U7","-","-","16:00:00","20:30:00","-","-","-","-","-","-","-","-","-","-","106I","107I","126I","E17I","118I",null,null,null,null,null,null,null,null,null,null,null,null,null,null,null,null,null,4,"2019-02-20",352377.62239999999,6290952.6169999996,"ZONA PAGA V368"]
[1,"Eliminada","ZP COMPARTIDA",436,"RM-1016","PI340","-","E-7-53-PO-55","-","ESTACIÓN CENTRAL","Parada 3 / (M) San Alberto Hurtado","U4","U2","U5","-","-","-","06:30:00","11:00:00","16:00:00","20:30:00","-","-","-","-","-","-","-","-","106I","210I","210vI","221eR","404I","407I","419I","423I","J13R","424I","481R",null,null,null,null,null,null,null,null,null,null,null,"-","2019-02-20",342990.23259999999,6297131.1012000004,"ZONA PAGA V368"]
[1,"Eliminada","ZP COMPARTIDA",437,"RM-1017","PI401","-","E-7-53-PO-50","-","ESTACIÓN CENTRAL","Parada 4 / (M) San Alberto Hurtado","U4","U3","U5","-","-","-","06:30:00","11:00:00","16:00:00","20:30:00","-","-","-","-","-","-","-","-","I09I","I09eI","I14I","I16I","401I","405I","412I","418I","421I","510I","511I","516I","J10I",null,null,null,null,null,null,null,null,null,"-","2019-02-20",342793.89649999997,6297077.9945,"ZONA PAGA V368"]
[1,"Eliminada","ZP COMPARTIDA",438,"RM-1018","PI148","-","E-13-278-OP-40","-","MAIPÚ","Parada 3/ (M) Plaza de Maipú","U5","U3","U4","-","-","-","06:30:00","22:00:00","-","-","-","-","-","-","-","-","-","-","108R","350I","I03R","I10R","I12R","I24R","109I","118R",null,null,null,null,null,null,null,null,null,null,null,null,null,null,2,"2019-02-22",336847.28,6290732.7300000004,"ZONA PAGA V368"]
[1,"Suspendida ","ZP COMPARTIDA",439,"RM-1019","PJ81","-","T-10-75-SN-5","-","PUDAHUEL ","Parada 1 / (M) Laguna Sur","U5","U3","-","-","-","-","06:30:00","22:00:00","-","-","-","-","-","-","-","-","-","-","111R","110R","110cR",null,null,null,null,null,null,null,null,null,null,null,null,null,null,null,null,null,null,2,2,"2019-02-22",338507.65399999998,6296094.9060000004,"ZONA PAGA V368"]
[1,"Eliminada","ZP",440,"RM-1020","PB1893","-","T-6-280-NS-5","-","QUILICURA","Parada 8/ (M) Los Libertadores ","U3","-","-","-","-","-","06:30:00","21:00:00","-","-","-","-","-","-","-","-","-","-","307cR","308cR","315cR",null,null,null,null,null,null,null,null,null,null,null,null,null,null,null,null,null,null,null,2,"2019-03-01",342790.98,6306918.1500000004,"ZONA PAGA V369"]
[1,"Activa","ZP COMPARTIDA",441,"RM-1021","PB1880","-","T-5-30-PO-6","-","RENCA","Parada 5/ Plaza Renca","U6","U5","-","-","-","-","06:30:00","15:30:00","-","-","-","-","-","-","-","-","-","-","105I","109I","120I","B09I",null,null,null,null,null,null,null,null,null,null,null,null,null,null,null,null,null,2,2,"2019-03-01",341328.38,6302573.1399999997,"ZONA PAGA V369"]
[1,"Activa","ZP COMPARTIDA",442,"RM-1022","PA109","-","E-20-205-SN-60","-","SANTIAGO"," Parada 8 / (M) Santa Lucía","U2","U6","-","-","-","-","16:00:00","21:00:00","-","-","-","-","-","-","-","-","-","-","203R","208I","203eR","B02I",null,null,null,null,null,null,null,null,null,null,null,null,null,null,null,null,null,2,2,"2019-03-21",347000.48859999998,6298345.4265999999,"ZONA PAGA V373"]
[1,"Activa","ZP COMPARTIDA",443,"RM-1023","PC244","-","T-15-136-OP-25","-","LAS CONDES","Parada 4/ Nudo Estoril","U4","U6","U5","-","-","-","16:00:00","20.30","-","-","-","-","-","-","-","-","-","-","406R","409R","411R","426R","430R","406cI","C01R","C01cR","C05I","C16R",null,null,null,null,null,null,null,null,null,null,null,2,"-","2019-04-01",357299.1041,6305185.2553000003,"ZONA PAGAV373"]
[1,"Eliminada","ZP",444,"RM-1024","PD381","-","T-32-316-OP-30","-","PEÑALOLÉN","Parada 4/ Los Presidentes","U4","-","-","-","-","-","06:30:00","11:00:00","16:30:00","20:30:00","-","-","-","-","-","-","-","-","425R","429R",null,null,null,null,null,null,null,null,null,null,null,null,null,null,null,null,null,null,null,null,"-","2019-04-03",353356.59,6294384.4500000002,"ZONA PAGAV374"]
[1,"Activa","ZP COMPARTIDA",445,"RM-1025","PB16","-","T-2-9-OP-20","-","CONCHALÍ","Parada 2/ Dorsal - Independencia ","U4","U6","U7","-","-","-","06:30:00","11:00:00","16:00:00","20:30:00","-","-","-","-","-","-","-","-","101I","107I","107cI","B10I","B27I",null,null,null,null,null,null,null,null,null,null,null,null,null,null,null,null,1,4,"2019-05-07",344773.97509999998,6303387.9700999996,"ZONA PAGA V379"]
[1,"Eliminada","ZP",446,"RM-1026","PB35","-","T-2-9-PO-10","-","CONCHALÍ","Parada 3/ Dorsal - Independencia ","U4","-","-","-","-","-","-","-","16:00:00","20:30:00","-","-","-","-","-","-","-","-","101R","107R","107cR",null,null,null,null,null,null,null,null,null,null,null,null,null,null,null,null,null,null,null,4,"2019-05-07",344697.79239999998,6303310.4418000001,"ZONA PAGA V379"]
[1,"Activa","ZP COMPARTIDA",447,"RM-1027","PG406","-","T-26-12-OP-20","-","LA CISTERNA","Parada 11 (M)La Cisterna","U6","U3","U5","-","-","-","06:30:00","21:30:00","-","-","-","-","-","-","-","-","-","-","120R","302R","118R",null,null,null,null,null,null,null,null,null,null,null,null,null,null,null,null,null,null,2,2,"2019-06-17",345367.75809999998,6287965.4412000002,"ZONA PAGA V383"]
[1,"Activa","ZP COMPARTIDA",448,"RM-1028","PB377","-","L-1-25-55-PO","-","INDEPENDENCIA","Salomón Sack esq. / Alc G. Domínguez","U3","U6","-","-","-","-","06:30:00","10:00:00","-","-","-","-","-","-","-","-","-","-","301I","B03I","B24I",null,null,null,null,null,null,null,null,null,null,null,null,null,null,null,null,null,null,1,2,"2019-06-08",344173.58669999999,6301262.2381999996,"ZONA PAGA V385"]
[1,"Activa","ZP COMPARTIDA",449,"RM-1029","PB378","-","L-1-25-55-PO","-","INDEPENDENCIA","Salomón Sack esq.. / Enrique Soro","U3","U6","-","-","-","-","06:30:00","10:00:00","-","-","-","-","-","-","-","-","-","-","301I","B03I","B24I",null,null,null,null,null,null,null,null,null,null,null,null,null,null,null,null,null,null,1,2,"2019-06-08",344483.61070000002,6301029.8619999997,"ZONA PAGA V385"]
[1,"Activa","ZP COMPARTIDA",450,"RM-1030","PB379","-","L-1-25-55-PO","-","INDEPENDENCIA","Salomón Sack esq. / Soberanía","U3","U6","-","-","-","-","06:30:00","10:00:00","-","-","-","-","-","-","-","-","-","-","301I","B03I","B24I",null,null,null,null,null,null,null,null,null,null,null,null,null,null,null,null,null,null,2,2,"2019-06-08",344748.24489999999,6300896.1452000001,"ZONA PAGA V385"]
[1,"Activa","ZP COMPARTIDA",451,"RM-1031","PB381","-","L-1-25-55-PO","-","INDEPENDENCIA","Salomón Sack esq. / Gamero","U3","U6","-","-","-","-","06:30:00","10:00:00","-","-","-","-","-","-","-","-","-","-","301I","B03I","B24I",null,null,null,null,null,null,null,null,null,null,null,null,null,null,null,null,null,null,1,2,"2019-06-08",345144.21932999999,6300696.2216800004,"ZONA PAGA V385"]
[1,"Activa","ZP COMPARTIDA",452,"RM-1032","PB382","-","L-1-13-10-PO","-","INDEPENDENCIA","Gamero esq. / Av. Fermín Vivaceta","U3","U6","-","-","-","-","06:30:00","10:00:00","-","-","-","-","-","-","-","-","-","-","301I","B03I","B24I",null,null,null,null,null,null,null,null,null,null,null,null,null,null,null,null,null,null,2,2,"2019-06-08",345383.55060000002,6300724.5360000003,"ZONA PAGA V385"]
[1,"Eliminada","ZP COMPARTIDA",453,"RM-1033","PA219","-","T-20-304-SN-10","-","SANTIAGO","Amunategui esq./ Huérfanos","U3","U5","-","-","-","-","06:30:00","10:00:00","-","-","-","-","-","-","-","-","-","-","301R","509I",null,null,null,null,null,null,null,null,null,null,null,null,null,null,null,null,null,null,null,null,2,"2019-06-08",346030.44,6298641.4900000002,"ZONA PAGA V385"]
[1,"Activa","ZP COMPARTIDA",454,"RM-1034","PB385","-","L-1-6-5-PO","-","INDEPENDENCIA","Parada/ Municipalidad de Independencia ","U3","U6","-","-","-","-","06:30:00","10:00:00","-","-","-","-","-","-","-","-","-","-","301I","B03I","B10I","B24I",null,null,null,null,null,null,null,null,null,null,null,null,null,null,null,null,null,2,2,"2019-06-08",346055.38030000002,6300699.9817000004,"ZONA PAGA V385"]
[1,"Eliminada","ZP COMPARTIDA",455,"RM-1035","PI169","-","E-7-50-NS-3","-","ESTACIÓN CENTRAL","Parada 5 / (M) Estación Central","U5","U3","U6","-","-","-","06:30:00","21:30:00","-","-","06:30:00","21:00:00","-","-","-","-","-","-","109I","345R","B26I",null,null,null,null,null,null,null,null,null,null,null,null,null,null,null,null,null,null,null,1,"2019-07-08",344042.9,6297334.5,"ZONA PAGA V388"]
[1,"Activa","ZP COMPARTIDA",456,"RM-1036","PB1563","-","E-2-9-OP-55","-","CONCHALÍ","Parada 4/ Norte Sur - Dorsal ","U4","U6","U7","-","-","-","16:00:00","20:30:00","-","-","-","-","-","-","-","-","-","-","101I","107I","107cI","B17R",null,null,null,null,null,null,null,null,null,null,null,null,null,null,null,null,null,1,5,"2019-07-12",343609.3,6302869.0999999996,"ZONA PAGA V388"]
[1,"Eliminada","ZP COMPARTIDA",457,"RM-1037","PB31","-","E-5--38-PO-30","-","CONCHALÍ","Parada 3/ Norte Sur - Dorsal ","U4","U6","-","-","-","-","06:30:00","11:00:00","-","-","-","-","-","-","-","-","-","-","101R","107R","107cR","B17I",null,null,null,null,null,null,null,null,null,null,null,null,null,null,null,null,null,null,5,"2019-07-12",343534,6302748.7000000002,"ZONA PAGA V388"]
[1,"Eliminada","ZP COMPARTIDA",458,"RM-1038","PI62","-","T-7-52-SN-10","-","ESTACIÓN CENTRAL","Avenida Las Rejas esq. / Quenac","U4","U7","-","-","-","-","06:30:00","11:00:00","-","-","-","-","-","-","-","-","-","-","107R","102R",null,null,null,null,null,null,null,null,null,null,null,null,null,null,null,null,null,null,null,null,4,"2019-07-12",341662.1,6295018.2000000002,"ZONA PAGA V388"]
[1,"Activa","ZP COMPARTIDA",459,"RM-1039","PC1068","-","L-17-46-5-SN","-","LAS CONDES","Parada 2/ (M) Los Dominicos ","U6","U4","U2","-","-","-","06:30:00","15:30:00","-","-","-","-","-","-","-","-","-","-","225R","D11I","C03R","C03cR","C16I",null,null,null,null,null,null,null,null,null,null,null,null,null,null,null,null,2,4,"2019-08-07",356332.6,6302387.5999999996,"ZONA PAGA V391"]
[1,"Eliminada","ZP COMPARTIDA",460,"RM-1040","PB1922","-","T-6-45-PO-93","-","QUILICURA","Av. Manuel A. Matta / esq.  De la Luna","U4","U6","U3","-","-","-","06:30:00","11:00:00","-","-","-","-","-","-","-","-","-","-","308cI","308I","425I","429I","430I","435I","429cI","B11R","B12R","B12cI","B21R",null,null,null,null,null,null,null,null,null,null,null,4,"2019-09-24",338930,6306854,"ZONA PAGA V399"]
[1,"Eliminada","ZP COMPARTIDA",461,"RM-1041","PB403","-","T-6-41-SN-10","-","QUILICURA","General San Martín / esq. Gral. San Martín","U4","U3","-","-","-","-","06:30:00","11:00:00","-","-","-","-","-","-","-","-","-","-","303I","428R","429I","430I","435I","429cI",null,null,null,null,null,null,null,null,null,null,null,null,null,null,null,null,4,"2019-10-01",338299.7,6306549.5999999996,"ZONA PAGA V399"]
[1,"Eliminada","ZP COMPARTIDA",462,"RM-1042","PB459","-","T-6-43-OP-10","-","QUILICURA","José F. Vergara / esq. Gral. San Martín","U4","U6","U3","-","-","-","06:30:00","11:00:00","-","-","-","-","-","-","-","-","-","-","303R","314I","314cI","428I","428eI","429cR","B08R","B18R",null,null,null,null,null,null,null,null,null,null,null,null,null,null,4,"2019-09-24",338399.3,6306754.7000000002,"ZONA PAGA V399"]
[1,"Eliminada","ZP COMPARTIDA",463,"RM-1043","PB460","-","T-6-41-NS-10","-","QUILICURA","General San Martín / esq. Intend. Saavedra","U4","U6","-","-","-","-","06:30:00","11:00:00","-","-","-","-","-","-","-","-","-","-","428I","429R","430R","435R","428eI","429cR","B18R",null,null,null,null,null,null,null,null,null,null,null,null,null,null,null,4,"2019-09-24",338273,6306284.7000000002,"ZONA PAGA V399"]
[1,"Activa","ZP COMPARTIDA",464,"RM-1044","PB528","-","T-6-41-SN-15","-","QUILICURA","General San Martín / esq. Av. Manuel A. Matta","U4","U6","-","-","-","-","06:30:00","11:00:00","-","-","-","-","-","-","-","-","-","-","429I","430I","435I","429cI","B12R","B12cI",null,null,null,null,null,null,null,null,null,null,null,null,null,null,null,2,4,"2019-09-24",338394.6,6307087,"ZONA PAGA V399"]
[1,"Suspendida ","ZPD COMPARTIDA",465,"RM-1200","PD539","-","T-32-156-PO-55","-","PEÑALOLÉN","Parada / Municipalidad de Peñalolén","U5","U4","-","-","-","-","06:30:00","20:30:00","-","-","-","-","-","-","-","-","-","-","D20I","506I","507I","511I","506eI","506vI","507cI","519I",null,null,null,null,null,null,null,null,null,null,null,null,null,2,"-","2019-10-11",358057.5,6294572.4000000004,"ZONA PAGA V400"]
[1,"Suspendida ","ZPD MOVIL",466,"RM-1201","PD548","-","T-32-156-OP-1","-","PEÑALOLÉN","Avenida Grecia / esq. Jacarandá","U5","-","-","-","-","-","06:30:00","20:30:00","-","-","-","-","-","-","-","-","-","-","506R","507R","511R","506vR","507cR","519R",null,null,null,null,null,null,null,null,null,null,null,null,null,null,null,2,"-","2019-10-11",355849,6295065.9000000004,"ZONA PAGA V400"]
[1,"Suspendida ","ZPD MOVIL",467,"RM-1202","PD574","PD551","T-32-156-OP-45","T-32-156-OP-40","PEÑALOLÉN","Parada 2 y 4/ Calle 1A - Avenida Grecia","U5","-","-","-","-","-","06:30:00","20:30:00","-","-","-","-","-","-","-","-","-","-","506R","507R","511R","506eR","506vR","507cR","519R",null,null,null,null,null,null,null,null,null,null,null,null,null,null,2,"-","2019-10-11",351026.5,6296178.7000000002,"ZONA PAGA DV002"]
[1,"Suspendida ","ZPD MOVIL",468,"RM-1203","PD578","PD555","T-18-156-OP-15","T-18-156-OP-10","ÑUÑOA","Parada 2 Y 4 / ADO Chile","U5","-","-","-","-","-","06:30:00","20:30:00","-","-","-","-","-","-","-","-","-","-","506R","507R","510R","516R","506vR","507cR","519R","511R",null,null,null,null,null,null,null,null,null,null,null,null,null,2,"-","2019-10-11",349210.5,6296580.5999999996,"ZONA PAGA DV002"]
[1,"Suspendida ","ZPD ",469,"RM-1204","PD579","PD556","T-18-156-OP-30","T-18-156-OP-25","ÑUÑOA","Parada 2 y 4 / Centro de Salud Salvador Bustos","U5","-","-","-","-","-","06:30:00","20:30:00","-","-","-","-","-","-","-","-","-","-","506R","507R","510R","516R","506vR","507cR","519R","511R",null,null,null,null,null,null,null,null,null,null,null,null,null,4,"-","2019-10-11",350065.7,6296344.5,"ZONA PAGA DV002"]
[1,"Suspendida ","ZPD MOVIL",470,"RM-1205","PD560","PD582","T-18-156-OP-50","T-18-156-OP-53","ÑUÑOA","Parada 2 y 4  / (M) Est.Nacional","U5","-","-","-","-","-","06:30:00","20:30:00","-","-","-","-","-","-","-","-","-","-","506R","507R","508R","510R","511R","516R","506eR","506vR","507cR","519R",null,null,null,null,null,null,null,null,null,null,null,2,"-","2019-10-11",352341.8,6295976,"ZONA PAGA DV002"]
[1,"Activa","ZPM",471,"RM-1045","PG1599","-","T-30-248-SN-28","-","SAN BERNARDO","Parada 2 / Plaza de San Bernardo","U2","-","-","-","-","-","06:00:00","21:00:00","-","-","10:00:00","15:00:00","-","-","-","-","-","-","201R","211R","201eR","211cR","217eI","271R",null,null,null,null,null,null,null,null,null,null,null,null,null,null,null,2,2,"2019-10-04",341911.2,6281752.5,"ZONA PAGA V400"]
[1,"Activa","ZPM",472,"RM-1046","PG1942","-","L-27-31-7-OP","-","EL BOSQUE","Parada/ Est. Lo blanco","U2","-","-","-","-","-","-","-","16:30:00","20:30:00","-","-","-","-","-","-","-","-","G14I","G23I",null,null,null,null,null,null,null,null,null,null,null,null,null,null,null,null,null,null,null,1,2,"2019-10-04",342415.7,6283797.7000000002,"ZONA PAGA V400"]
[1,"Activa","ZPM",473,"RM-1047","PB330","-","E-4-19-SN-80","-","RECOLETA","Parada 2 / (M) Zapadores","U2","U6","-","-","-","-","-","-","16:30:00","21:00:00","-","-","-","-","-","-","-","-","203R","208I","208cI","B19I",null,null,null,null,null,null,null,null,null,null,null,null,null,null,null,null,null,2,2,"2019-10-04",347251.6,6304100.2999999998,"ZONA PAGA V400"]
[1,"Suspendida ","ZPD",474,"RM-1206","PD592","PD532","T-18-156-PO-57","T-18-156-PO-55","ÑUÑOA","Parada 1 / Centro de Salud Salvador Bustos","U5","-","-","-","-","-","06:00:00","21:00:00","-","-","-","-","-","-","-","-","-","-","506I","507I","510I","511I","516I","506vI","507cI","519I","508I",null,null,null,null,null,null,null,null,null,null,null,null,2,"-","2019-11-14",352341.8,6295976,"ZONA PAGA DV002"]
[1,"Espera ","ZPD",475,"-","PD116","PD529","T-18-156-PO-33","T-18-156-PO-30","ÑUÑOA","Parada 1 y 3 / Los Tres Antonios","U5","-","-","-","-","-","-","-","-","-","-","-","-","-","-","-","-","-","506I","507I","510I","511I","516I","506vI","507cI","519I","106I","126I",null,null,null,null,null,null,null,null,null,null,null,null,"-",null,350994.7,6296189.2000000002,""]
[1,"Espera ","ZPDM",476,"-","PD1322","-","T-32-156-PO-37","-","PEÑALOLÉN","Parada 1 / Tobalaba - Avenida Grecia","U5","-","-","-","-","-","-","-","-","-","-","-","-","-","-","-","-","-","506I","507I","511I","506eI","506vI","507cI","519I",null,null,null,null,null,null,null,null,null,null,null,null,null,null,null,"-",null,355407.6,6295163.5,""]
[1,"Espera ","ZPD",477,"-","PD1323","-","T-32-156-PO-48","-","PEÑALOLÉN","Avenida Grecia / esq. Av. Consistorial","U5","-","-","-","-","-","-","-","-","-","-","-","-","-","-","-","-","-","506I","507I","511I","506eI","506vI","507cI","519I",null,null,null,null,null,null,null,null,null,null,null,null,null,null,null,"-",null,356534.9,6294901.5999999996,""]
[1,"Espera ","ZPD",478,"-","PD1359","-","T-32-156-OP-10","-","PEÑALOLÉN","Parada / Municipalidad de Peñalolén","U5","-","-","-","-","-","-","-","-","-","-","-","-","-","-","-","-","-","506R","507R","511R","506eR","506vR","507cR","519R",null,null,null,null,null,null,null,null,null,null,null,null,null,null,null,"-",null,356698.1,6294878,""]
[1,"Espera ","ZPD",479,"-","PD525","PD643","T-18-156-PO-10","T-18-156-PO-12","ÑUÑOA","Parada 1 y 3 / Suárez Mujica","U5","-","-","-","-","-","-","-","-","-","-","-","-","-","-","-","-","-","506I","507I","510I","516I","506vI","507cI","519I",null,null,null,null,null,null,null,null,null,null,null,null,null,null,null,"-",null,349085.2,6296714.5999999996,""]
[1,"Espera ","ZPDM",480,"-","PD537","-","T-32-156-PO-38","-","PEÑALOLÉN","Avenida Grecia / esq. Los Tordos","U5","-","-","-","-","-","-","-","-","-","-","-","-","-","-","-","-","-","506I","507I","511I","506eI","506vI","507cI","519i",null,null,null,null,null,null,null,null,null,null,null,null,null,null,null,"-",null,355709.5,6295083.5,""]
[1,"Espera ","ZPDM",481,"-","PD538","-","T-32-156-PO-45","-","PEÑALOLÉN","Avenida Grecia / esq. Las Garzas","U5","-","-","-","-","-","-","-","-","-","-","-","-","-","-","-","-","-","506I","507I","511I","506vI","507cI","519I",null,null,null,null,null,null,null,null,null,null,null,null,null,null,null,null,"-",null,356156.4,6294984.2000000002,""]
[1,"Espera ","ZPD COMPARTIDA",482,"-","PD544","-","L-32-16-55-OP","-","PEÑALOLÉN","Avenida Grecia / esq. Qda. de Sn. Pedro","U5","U4","-","-","-","-","-","-","-","-","-","-","-","-","-","-","-","-","D08I","D09I","D20I","506R","507R","511R","506eR","506vR","507cR","519R",null,null,null,null,null,null,null,null,null,null,null,null,"-",null,358057.5,6294572.4000000004,""]
[1,"Espera ","ZPD",483,"-","PD545","-","L-32-16-45-OP","-","PEÑALOLÉN","Avenida Grecia / esq. Los Picachos","U5","U4","-","-","-","-","-","-","-","-","-","-","-","-","-","-","-","-","D08I","D09I","D20I","506R",null,null,null,null,null,null,null,null,null,null,null,null,null,null,null,null,null,null,"-",null,357721.1,6294645.0999999996,""]
[1,"Espera ","ZPD",484,"-","PD547","-","T-32-156-OP-5","-","PEÑALOLÉN","Avenida Grecia / esq. Amanecer","U5","-","-","-","-","-","-","-","-","-","-","-","-","-","-","-","-","-","506R","507R","511R","506eR","506vR","507cR","519R",null,null,null,null,null,null,null,null,null,null,null,null,null,null,null,"-",null,357021.3,6294806.7000000002,""]
[1,"Espera ","ZPDM",485,"-","PD549","-","T-32-156-OP-20","-","PEÑALOLÉN","Avenida Grecia / esq. Palena","U5","-","-","-","-","-","-","-","-","-","-","-","-","-","-","-","-","-","506R","507R","511R","506vR","507cR","519R",null,null,null,null,null,null,null,null,null,null,null,null,null,null,null,null,"-",null,356272.2,6294971.4000000004,""]
[1,"Espera ","ZPD",486,"-","PD550","-","T-32-156-OP-35","-","PEÑALOLÉN","Avenida Grecia / esq. Pasaje 444","U5","-","-","-","-","-","-","-","-","-","-","-","-","-","-","-","-","-","506R","507R","511R","506eR","506vR","507cR","519R",null,null,null,null,null,null,null,null,null,null,null,null,null,null,null,"-",null,355849,6295065.9000000004,""]
[1,"Espera ","ZPD",487,"-","PD559","-","T-18-156-OP-40","-","ÑUÑOA","Parada 2 / Pedagógico","U5","-","-","-","-","-","-","-","-","-","-","-","-","-","-","-","-","-","506R","507R","510R","516R","506eR","506vR","507cR","519R",null,null,null,null,null,null,null,null,null,null,null,null,null,null,"-",null,351529.7,6296069.4000000004,""]
[1,"Espera ","ZPDM",488,"-","PD571","-","T-32-156-PO-10","-","PEÑALOLÉN","Parada 1 / Los Molineros - Av. Grecia","U5","-","-","-","-","-","-","-","-","-","-","-","-","-","-","-","-","-","505I","506I","507I","510I","511I","516I","506vI","507cI","519I",null,null,null,null,null,null,null,null,null,null,null,null,null,"-",null,354177.3,6295432.2000000002,""]
[1,"Espera ","ZPDM",489,"-","PD572","-","T-32-156-PO-25","-","PEÑALOLÉN","Parada 1 / Ictinos - Avenida Grecia","U5","-","-","-","-","-","-","-","-","-","-","-","-","-","-","-","-","-","506I","507I","511I","506eI","506vI","507cI","519I",null,null,null,null,null,null,null,null,null,null,null,null,null,null,null,"-",null,354701.2,6295318.9000000004,""]
[1,"Espera ","ZPDM",490,"-","PD573","-","T-32-156-PO-35","-","PEÑALOLÉN","Parada 1 / Calle 1A - Avenida Grecia","U5","-","-","-","-","-","-","-","-","-","-","-","-","-","-","-","-","-","506I","507I","511I","506vI","507cI","519I",null,null,null,null,null,null,null,null,null,null,null,null,null,null,null,null,"-",null,355186.2,6295211.9000000004,""]
[1,"Espera ","ZPD",491,"-","PD576","-","T-32-156-OP-75","-","PEÑALOLÉN","Parada 2 / Los Molineros   Av. Grecia","U5","-","-","-","-","-","-","-","-","-","-","-","-","-","-","-","-","-","505R","506R","507R","510R","516R","506eR","506vR","507cR","519R",null,null,null,null,null,null,null,null,null,null,null,null,null,"-",null,354329,6295410.0999999996,""]
[1,"Espera ","ZPD",492,"-","PD577","PD517","T-32-156-OP-85","T-32-156-OP-80","PEÑALOLÉN","Parada 2 y 4/ Cruz Almeyda - Avenida Grecia","U5","-","-","-","-","-","-","-","-","-","-","-","-","-","-","-","-","-","505R","506R","507R","510R","511R","516R","506vR","507cR","519R","511R",null,null,null,null,null,null,null,null,null,null,null,null,"-",null,353853,6295514.7999999998,""]
[1,"Espera ","ZPD",493,"-","PD581","PD161","T-18-156-OP-48","T-18-156-OP-45","ÑUÑOA","Parada 2 y 4/ Los Tres Antonios","U5","-","-","-","-","-","-","-","-","-","-","-","-","-","-","-","-","-","216I","425R","506R","507R","510R","516R","506vR","507cR","519R","712I",null,null,null,null,null,null,null,null,null,null,null,null,"-",null,351026.5,6296178.7000000002,""]
[1,"Espera ","ZPD",494,"-","PD583","PD561","T-18-156-OP-58","T-18-156-OP-55","ÑUÑOA","Parada 2 y 4/ Avenida Marathon","U5","-","-","-","-","-","-","-","-","-","-","-","-","-","-","-","-","-","506R","507R","510R","516R","506vR","507cR","519R","508R","511R",null,null,null,null,null,null,null,null,null,null,null,null,null,"-",null,350144.4,6296352.9000000004,""]
[1,"Espera ","ZPD",495,"-","PD584","PD562","T-18-156-OP-62","T-18-156-OP-60","ÑUÑOA","Parada 2 y 4/ Villa Olímpica","U5","-","-","-","-","-","-","-","-","-","-","-","-","-","-","-","-","-","506R","507R","510R","516R","506eR","506vR","507cR","519R","508R",null,null,null,null,null,null,null,null,null,null,null,null,null,"-",null,349697.3,6296383.0999999996,""]
[1,"Espera ","ZPD",496,"-","PD585","PD563","T-18-156-OP-65","T-18-156-OP-63","ÑUÑOA","Parada 2 y 4/ Suárez Mujica","U5","-","-","-","-","-","-","-","-","-","-","-","-","-","-","-","-","-","506R","507R","510R","516R","506vR","507cR","519R",null,null,null,null,null,null,null,null,null,null,null,null,null,null,null,"-",null,349210.5,6296580.5999999996,""]
[1,"Espera ","ZPD",497,"-","PD589","PD527","T-18-156-PO-20","T-18-156-PO-25","ÑUÑOA","Parada 1 y 3/ Avenida Marathon","U5","-","-","-","-","-","-","-","-","-","-","-","-","-","-","-","-","-","506I","507I","510I","511I","516I","506vI","507cI","519I","106I","126I","508I",null,null,null,null,null,null,null,null,null,null,null,"-",null,350065.7,6296344.5,""]
[1,"Espera ","ZPD",498,"-","PD590","-","T-18-156-PO-37",null,"ÑUÑOA","Parada 1 / Pedagógico","U5","-","-","-","-","-","-","-","-","-","-","-","-","-","-","-","-","-","506I","507I","510I","511I","516I","506eI","506vI","507cI","519I","508I",null,null,null,null,null,null,null,null,null,null,null,null,"-",null,351592.5,6296053,""]
[1,"Espera ","ZPD",499,"-","PD644","PD526","T-18-156-PO-15","T-18-156-PO-13","ÑUÑOA","Parada 1 y 3 / Villa Olímpica","U5","-","-","-","-","-","-","-","-","-","-","-","-","-","-","-","-","-","506I","507I","510I","516I","506eI","506vI","507cI","519I","508I",null,null,null,null,null,null,null,null,null,null,null,null,null,"-",null,349584.4,6296379.4000000004,""]
[1,"Activa","ZP",500,"RM-1048","PC37","-","T-14-128-OP-13","-","PROVIDENCIA","Parada 8 / (M) Los Leones","U7","-","-","-","-","-","13:00:00","18:00:00","-","-","-","-","-","-","-","-","-","-","104I",null,null,null,null,null,null,null,null,null,null,null,null,null,null,null,null,null,null,null,null,2,"-","2019-10-28",350494.5,6300924.5999999996,"ZONA PAGA V409"]
[1,"Eliminada","ZPM COMPARTIDA ",501,"RM-1049","PA16","-","E-20-53-OP-130","-","ESTACIÓN CENTRAL","Parada 2/ (M) Estacion Central ","U4","U5","U2","U6","U3","-","06:30:00","11:00:00","16:00:00","20:30:00","-","-","-","-","-","-","-","-","210R","210vR","221eI","385R","407R","412R","418R","507R","511R","513R","J16I","B28I","109R",null,null,null,null,null,null,null,null,null,"-","2017-12-07",344000.7,6297510.9000000004,"ZONA PAGA V409"]
[1,"Eliminada","ZPM COMPARTIDA ",502,"RM-1050","PA368","-","E-20-53-PO-5","-","ESTACIÓN CENTRAL","Parada 4/ (M) Estacion Central ","U4","U5","-","-","-","-","06:30:00","11:00:00","16:00:00","20:30:00","-","-","-","-","-","-","-","-","406I","422I","426I","507I","510I","513I",null,null,null,null,null,null,null,null,null,null,null,null,null,null,null,null,"-","2019-11-29",344122.8,6297496.7999999998,"ZONA PAGA V409"]
[1,"Eliminada","ZPM COMPARTIDA ",503,"RM-1051","PI62","-","T-7-52-SN-10","-","ESTACIÓN CENTRAL","Avenida Las Rejas / esq. Quenac","U4","U7","-","-","-","-","06:30:00","11:00:00","16:00:00","20:30:00","-","-","-","-","-","-","-","-","102R","107R",null,null,null,null,null,null,null,null,null,null,null,null,null,null,null,null,null,null,null,null,"-","2019-11-29",341662.1,6295018.2000000002,"ZONA PAGA V409"]
[1,"Suspendida ","ZPM COMPARTIDA ",504,"RM-1052","PI759","-","L-9-7-70-OP","-","LO PRADO","Parada 2 / (M) Pajaritos","U5",null,"-","-","-","-","06:00:00","21:00:00","-","-","06:30:00","21:00:00","-","-","-","-","-","-","412R","418R","510R","516R","J06I",null,null,null,null,null,null,null,null,null,null,null,null,null,null,null,null,2,"-","2019-11-29",340548.8,6296728.4000000004,"ZONA PAGA V409"]
[1,"Suspendida ","ZP ",505,"RM-1053","PJ165","-","E-9-53-OP-20","-","LO PRADO","Parada 6 / (M) Las Rejas","U5","-","-","-","-","-","06:00:00","21:00:00","-","-","06:30:00","21:00:00","-","-","-","-","-","-","404R","404cR","510R","516R","424R",null,null,null,null,null,null,null,null,null,null,null,null,null,null,null,null,3,"-","2019-11-29",341261.2,6296679.5999999996,"ZONA PAGA V409"]
[1,"Activa","ZPM COMPARTIDA ",506,"RM-1054","PI181","-","T-12-55-NS-15","-","CERRILLOS","Parada 1 / (M) Cerrillos","U5","U7","U3","-","-","-","06:00:00","20:30:00","-","-","06:30:00","20:00:00","-","-","-","-","-","-","108R","113R","113cR","109I","115R","115cI",null,null,null,null,null,null,null,null,null,null,null,null,null,null,null,3,"-","2019-11-29",342404.3,6293760.7000000002,"ZONA PAGA V409"]
[1,"Suspendida ","ZPM",507,"RM-1055","PD579","-","T-18-156-OP-30","-","ÑUÑOA","Parada 2 / Centro De Salud Salvador Bustos","U5","-","-","-","-","-","06:00:00","21:00:00","-","-","-","-","-","-","-","-","-","-","506R","507R","510R","516R","506vR","507cR","519R",null,null,null,null,null,null,null,null,null,null,null,null,null,null,2,"-","2019-11-29",352270.3,6296005.7000000002,"ZONA PAGA V409"]
[1,"Activa","ZPM COMPARTIDA ",508,"RM-1056","PI148","-","E-13-278-OP-40","-","MAIPÚ","Parada 3/ (M) Plaza de Maipú","U3","U7","U5","-","-","-","06:30:00","21:30:00","-","-","-","-","-","-","-","-","-","-","108R","I11I","I03R","I10R","I12R","I24R","109I","118R","481I","350cI",null,null,null,null,null,null,null,null,null,null,null,2,"-","2019-02-22",336847.3,6290732.7000000002,"ZONA PAGA V410"]
[1,"Activa","ZPM COMPARTIDA ",509,"RM-1057","PI657","-","E-13-278-OP-40","-","MAIPÚ","Parada 6/ (M) Plaza de Maipú","U3","U5","U7","-","-","-","06:30:00","21:30:00","-","-","-","-","-","-","-","-","-","-","348I","I01I","I03I","I04I","I05I","I10I","I18I","110I","481R",null,null,null,null,null,null,null,null,null,null,null,null,2,"-","2019-12-13",337018.4,6290727.0999999996,"ZONA PAGA V410"]
[1,"Suspendida ","ZPM",510,"RM-1058","PH293","-","T-28-181-NS-5","-","PEDRO AGUIRRE CERDA","Parada 3/ (M) Pedro Aguirre Cerda ","U3","-","-","-","-","-","17:00:00","21:30:00","-","-","-","-","-","-","-","-","-","-","119I","121I","345R","H07I","I01R",null,null,null,null,null,null,null,null,null,null,null,null,null,null,null,null,2,"-","2019-12-13",345312.4,6294437.7999999998,"ZONA PAGA V410"]
[1,"Suspendida ","ZPM",511,"RM-1059","PI1788","-","I-13-54-NS-51","-","MAIPÚ","Parada / Estacion Intermodal del Sol ","U3","-","-","-","-","-","17:00:00","21:30:00","-","-","-","-","-","-","-","-","-","-","I07R","I08R","I09eR","I22R",null,null,null,null,null,null,null,null,null,null,null,null,null,null,null,null,null,1,"-","2019-12-13",335843.8,6289534.2000000002,"ZONA PAGA V410"]
[1,"Activa","ZPM COMPARTIDA ",512,"RM-1060","PA367","-","E-20-53-OP-125","-","SANTIAGO","Parada 3/ (M) Estación Central ","U5","U7","U3","-","-","-","11:00:00","19:00:00","-","-","11:00:00","19:00:00","-","-","-","-","-","-","I09R","I09eR","I14R","404R","481I","510R","516R","J10R","J13I","424R","-","-","-","-","-","-","-","-","-","-","-",3,"-","2019-12-27",344099.9,6297543.5,"ZONA PAGA V411"]
[1,"Eliminada","ZPM",513,"RM-1061","PA448","-","T-20-189-OP-30","-","SANTIAGO","Avenida Matta / esq. San Diego","U5","-","-","-","-","-","06:30:00","21:00:00","-","-","-","-","-","-","-","-","-","-","506R","507R","510R","506eR","506vR","507cR","-","-","-","-","-","-","-","-","-","-","-","-","-","-","-",null,"-","2019-12-27",346770.5,6296575.2000000002,"ZONA PAGA V412"]
[1,"Eliminada","ZPM COMPARTIDA ",514,"RM-1062","PB457","-","T-6-44-NS-5",null,"QUILICURA","Parada 1  Plaza Quilicura ","U4","U3","-","-","-","-","06:30:00","11:00:00","-","-","-","-","-","-","-","-","-","-","428I","428eI","303R",null,null,null,null,null,null,null,null,null,null,null,null,null,null,null,null,null,null,null,4,"2020-02-24",338935.8,6306585.0999999996,"ZONA PAGA V420"]
[1,"Espera ","ZPMC",1002,"RM-0933","-","-","-","-","CONTINGENCIA","Provisoria/ Contingencia ","U2",null,null,null,null,null,null,null,null,null,null,null,null,null,null,null,null,null,null,null,null,null,null,null,null,null,null,null,null,null,null,null,null,null,null,null,null,null,null,3,"-","2020-02-03","-","-","-"]
[1,"Espera ","ZPMC",1003,"RM-0956","-","-","-","-","CONTINGENCIA","Provisoria/ Contingencia ","U3",null,null,null,null,null,null,null,null,null,null,null,null,null,null,null,null,null,null,null,null,null,null,null,null,null,null,null,null,null,null,null,null,null,null,null,null,null,null,null,"-","2020-02-03","-","-","-"]
[1,"Espera ","ZPMC",1004,"RM-0957","-","-","-","-","CONTINGENCIA","Provisoria/ Contingencia ","U4",null,null,null,null,null,null,null,null,null,null,null,null,null,null,null,null,null,null,null,null,null,null,null,null,null,null,null,null,null,null,null,null,null,null,null,null,null,null,null,"-","2020-02-03","-","-","-"]
[1,"Espera ","ZPMC",1005,"RM-0958","-","-","-","-","CONTINGENCIA","Provisoria/ Contingencia ","U5",null,null,null,null,null,null,null,null,null,null,null,null,null,null,null,null,null,null,null,null,null,null,null,null,null,null,null,null,null,null,null,null,null,null,null,null,null,null,null,"-","2020-02-03","-","-","-"]
[1,"Activa","ZPMC",1006,"RM-0959","-","-","-","-","CONTINGENCIA","Provisoria/ Contingencia ","U6",null,null,null,null,null,null,null,null,null,null,null,null,null,null,null,null,null,null,null,null,null,null,null,null,null,null,null,null,null,null,null,null,null,null,null,null,null,null,3,"-","2020-02-03","-","-","-"]
[1,"Espera ","ZPMC",1007,"RM-0964","-","-","-","-","CONTINGENCIA","Provisoria/ Contingencia ","U7",null,null,null,null,null,null,null,null,null,null,null,null,null,null,null,null,null,null,null,null,null,null,null,null,null,null,null,null,null,null,null,null,null,null,null,null,null,null,null,"-","2020-02-03","-","-","-"]
[1,"Suspendida ","ZP",515,"RM-1063","PJ124","-","E-10-71-PO-75","-","PUDAHUEL","Parada 4 / (M) Pudahuel","U5","-","-","-","-","-","06:30:00","11:00:00","16:00:00","20:30:00","-","-","-","-","-","-","-","-","402I","406I","407I","422I","426I","422cI","486I",null,null,null,null,null,null,null,null,null,null,null,null,null,null,2,"-","2007-08-24",338158.27,6298049.2699999996,"ZONA PAGA V441"]
[1,"Suspendida ","ZP",516,"RM-1064","PJ118","-","T-10-71-PO-33","-","PUDAHUEL","Parada 1 / Consultorio   Pudahuel -Poniente","U5","-","-","-","-","-","06:30:00","11:00:00","16:00:00","20:30:00","-","-","-","-","-","-","-","-","402I","406I","407I","426I","J07I","J07eI","486I",null,null,null,null,null,null,null,null,null,null,null,null,null,null,2,"-","2017-04-24",335983.37,6298295.9900000002,"ZONA PAGA V443"]
[1,"Activa","ZP",517,"RM-1065","PJ153","-","E-10-71-OP-4","-","PUDAHUEL","Parada 1 / (M) Pudahuel","U5","-","-","-","-","-","06:30:00","20:00:00","-","-","07:00:00","20:00:00","-","-","-","-","-","-","402R","406R","426R","486I","407R",null,null,null,null,null,null,null,null,null,null,null,null,null,null,null,null,2,"-","2017-04-24",338154.45,6298072.2800000003,"ZONA PAGA V443"]
[1,"Activa","ZP",518,"RM-1066","PJ149","-","E-9-71-OP-33","-","LO PRADO","Parada 7 / (M) San Pablo","U5","-","-","-","-","-","12:00:00","20:00:00","-","-","12:00:00","20:00:00","-","-","-","-","-","-","402R","406R","407R","422R","426R","486I","422cR",null,null,null,null,null,null,null,null,null,null,null,null,null,null,2,"-","2017-07-31",339764.44,6298136.2300000004,"ZONA PAGA V443"]
[1,"Activa","ZP",519,"RM-1067","PA368","-","E-20-53-PO-5","-","ESTACIÓN CENTRAL","Parada 4/ (M) Estacion Central ","U5","-","-","-","-","-","11:00:00","19:00:00","-","-","11:00:00","19:00:00","-","-","-","-","-","-","507I","510I","511I","513I","516I","J13R","424I","404I","406I","422I","426I",null,null,null,null,null,null,null,null,null,null,2,null,"2019-11-29",344122.8,6297496.7999999998,"ZONA PAGA V443"]
[1,"Activa","ZP COMPARTIDA",520,"RM-1068","PA16","-","E-20-53-OP-130","-","ESTACIÓN CENTRAL","Parada 2/ (M) Estacion Central ","U5","U6","U2","U3","-","-","11:00:00","19:00:00","-","-","11:00:00","19:00:00","-","-","-","-","-","-","210R","210VR","221eI","385R","507R","511R","513R","J16I","407R","412R","418R","B28I","109R",null,null,null,null,null,null,null,null,3,null,"2017-12-07",344000.7,6297510.9000000004,"ZONA PAGA V443"]
[1,"Activa","ZP",521,"RM-1069","PJ586","-","L-8-22-15-NS","-","QUINTA NORMAL","Parada 10/ (M) San Pablo","U5","-","-","-","-","-","12:00:00","20:00:00","-","-","12:00:00","20:00:00","-","-","-","-","-","-","J01I",null,null,null,null,null,null,null,null,null,null,null,null,null,null,null,null,null,null,null,null,3,"-","2020-08-11",343036.4,6299515.0999999996,"ZONA PAGA V446"]
[1,"Activa","ZP",522,"RM-1070","PJ1587","-","L-9-29-5-PO","-","LO PRADO","Parada 4 / (M) San Pablo","U5","-","-","-","-","-","12:00:00","20:00:00","-","-","12:00:00","20:00:00","-","-","-","-","-","-","J18R","J18cR",null,null,null,null,null,null,null,null,null,null,null,null,null,null,null,null,null,null,null,2,"-","2007-03-19",339895.5,6297981.7000000002,"ZONA PAGA V446"]
[1,"Activa","ZP",523,"RM-1071","PJ956","-","E-9-71-OP-32","-","LO PRADO","Parada 1 / (M) San Pablo","U5","-","-","-","-","-","12:00:00","20:00:00","-","-","12:00:00","20:00:00","-","-","-","-","-","-","J13I","J13cI",null,null,null,null,null,null,null,null,null,null,null,null,null,null,null,null,null,null,null,2,"-","2007-11-20",339866.6,6298148.5999999996,"ZONA PAGA V446"]
[1,"Suspendida ","ZP",524,"RM-1072","PJ686","-","L-9-13-60-NS","-","LO PRADO","Parada 3/  (M) San Pablo","U5","-","-","-","-","-","06:30:00","20:30:00","-","-","06:30:00","20:30:00","-","-","-","-","-","-","511I","J04I","J08R","J15cI",null,null,null,null,null,null,null,null,null,null,null,null,null,null,null,null,null,2,"-","2007-12-03",339845.8,6297447.5999999996,"ZONA PAGA V446"]
[1,"Activa","ZP",525,"RM-1073","PA378","-","E-20-68-SN-5","-","ESTACIÓN CENTRAL","Parada 1/ (M) Estación CentraL","U5","-","-","-","-","-","11:00:00","19:00:00","-","-","11:00:00","19:00:00","-","-","-","-","-","-","406R","422R","426R",null,null,null,null,null,null,null,null,null,null,null,null,null,null,null,null,null,null,2,"-","2016-08-29",343953.9,6297545.0999999996,"ZONA PAGA V453"]
[1,"Activa","ZP",526,"RM-1074","PB1960","-","TI-1-3-NS-175","-","INDEPENDENCIA","Parada 6/ (M) Pza. Chacabuco","U2","U6","U3","-","-","-","06:00:00","21:00:00","-","-","06:30:00","20:30:00","-","-","-","-","-","-","201I","230I","308I","B14I","B25I","B27I",null,null,null,null,null,null,null,null,null,null,null,null,null,null,null,3,"-",null,345570.22925875452,6302308.8817815771,"-"]
[1,"Activa","ZP",527,"RM-1075","PB1950","-","TI-1-3-NS-42","-","INDEPENDENCIA","Av. Independencia/ esq. Dávila Baeza ","U2","U6","U3","-","-","-","06:00:00","21:00:00","-","-","06:30:00","20:30:00","-","-","-","-","-","-","201I","214R","230I","308I","B14I","B27I",null,null,null,null,null,null,null,null,null,null,null,null,null,null,null,3,"-",null,346178.31759718072,6300283.4880913636,"-"]
[1,"Activa","ZP",528,"RM-1076","PB1951","-","TI-1-3-NS-75","-","INDEPENDENCIA","Parada 3/ Hospital Clinico U. de Chile ","U2","U6","U3","-","-","-","06:00:00","21:00:00","-","-","06:30:00","20:30:00","-","-","-","-","-","-","201I","214R","230I","308I","B14I","B27I",null,null,null,null,null,null,null,null,null,null,null,null,null,null,null,3,"-",null,346068.20779880951,6300822.2642475627,"-"]
[1,"Activa","ZP",529,"RM-1077","PB198","-","T-2-3-NS-70","-","CONCHALÍ","Parada 1/ (M) Conchali ","U2","U3","-","-","-","-","06:00:00","11:00:00","-","-","06:30:00","20:30:00","-","-","-","-","-","-","201I","230I","308I",null,null,null,null,null,null,null,null,null,null,null,null,null,null,null,null,null,null,2,"-",null,344682.3,6303384.9000000004,"-"]
[1,"Activa","ZP",530,"RM-1078","PB279","-","T-2-3-SN-5","-","CONCHALÍ","Parada 2/ (M) Conchali","U2","U6","U3","-","-","-","-","-","16:00:00","21:00:00","06:30:00","20:30:00","-","-","-","-","-","-","201R","230I","308R","B22R",null,null,null,null,null,null,null,null,null,null,null,null,null,null,null,null,null,2,"-",null,344777,6303329,"-"]
[1,"Activa","ZPM COMPARTIDA ",531,"RM-1079","PB1980","-","I-4-454-PO-4","-","QUILICURA","Andén 2 / (EIM) Los Libertadores","U6","U3","-","-","-","-","06:30:00","21:00:00","-","-","-","-","-","-","-","-","-","-","B08R",null,null,null,null,null,null,null,null,null,null,null,null,null,null,null,null,null,null,null,null,1,6,"2020-11-30",342541.6,6306939.5,"ZONA PAGA V460"]
[1,"Activa","ZPM COMPARTIDA ",531,"RM-1079","PB1981","-","I-4-454-PO-10","-","QUILICURA","Andén 3 / (EIM) Los Libertadores","U6","U3","-","-","-","-","06:30:00","21:00:00","-","-","-","-","-","-","-","-","-","-","314cR",null,null,null,null,null,null,null,null,null,null,null,null,null,null,null,null,null,null,null,null,1,6,"2020-11-30",342576.9,6306938.9000000004,"ZONA PAGA V460"]
[1,"Activa","ZPM COMPARTIDA ",531,"RM-1079","PB1982","-","I-4-454-PO-14","-","QUILICURA","Andén 4 / (EIM) Los Libertadores","U6","U3","-","-","-","-","06:30:00","21:00:00","-","-","-","-","-","-","-","-","-","-","B18R",null,null,null,null,null,null,null,null,null,null,null,null,null,null,null,null,null,null,null,null,1,6,"2020-11-30",342613.7,6306939.2000000002,"ZONA PAGA V460"]
[1,"Activa","ZPM COMPARTIDA ",531,"RM-1079","PB1983","-","I-4-454-PO-18","-","QUILICURA","Andén 5 / (EIM) Los Libertadores","U6","U3","-","-","-","-","06:30:00","21:00:00","-","-","-","-","-","-","-","-","-","-","B26I",null,null,null,null,null,null,null,null,null,null,null,null,null,null,null,null,null,null,null,null,1,6,"2020-11-30",342646.9,6306938.9000000004,"ZONA PAGA V460"]
[1,"Activa","ZPM COMPARTIDA ",531,"RM-1079","PB1984","-","I-4-454-PO-22","-","QUILICURA","Andén 6 / (EIM) Los Libertadores","U6","U3","-","-","-","-","06:30:00","21:00:00","-","-","-","-","-","-","-","-","-","-","B04I",null,null,null,null,null,null,null,null,null,null,null,null,null,null,null,null,null,null,null,null,1,6,"2020-11-30",342670.2,6306938,"ZONA PAGA V460"]
[1,"Activa","ZP",532,"RM-1080","PB1986","-","I-4-454-PO-24","-","QUILICURA","Andén 7 / (EIM) Los Libertadores","U6","-","-","-","-","-","06:30:00","21:00:00","-","-","-","-","-","-","-","-","-","-","B07R",null,null,null,null,null,null,null,null,null,null,null,null,null,null,null,null,null,null,null,null,2,2,"2020-11-30",342541.6,6306939.5,"ZONA PAGA V460"]
[1,"Activa","ZP",532,"RM-1080","PB1987","-","I-4-454-PO-20","-","QUILICURA","Andén 8 / (EIM) Los Libertadores","U6","-","-","-","-","-","06:30:00","21:00:00","-","-","-","-","-","-","-","-","-","-","B12cR",null,null,null,null,null,null,null,null,null,null,null,null,null,null,null,null,null,null,null,null,2,2,"2020-11-30",342541.6,6306939.5,"ZONA PAGA V460"]
[1,"Activa","ZP",533,"RM -1081","PB1989","-","I-6-454-PO-12","-","QUILICURA","Andén 11 / (EIM) Los Libertadores","U3","-","-","-","-","-","06:30:00","21:00:00","-","-","-","-","-","-","-","-","-","-","308cR",null,null,null,null,null,null,null,null,null,null,null,null,null,null,null,null,null,null,null,null,3,3,"2020-11-30",342597.5,6306919.4000000004,"ZONA PAGA V461"]
[1,"Activa","ZP",533,"RM -1081","PB1990","-","I-6-454-PO-8","-","QUILICURA","Andén 12 / (EIM) Los Libertadores","U3","-","-","-","-","-","06:30:00","21:00:00","-","-","-","-","-","-","-","-","-","-","315cR",null,null,null,null,null,null,null,null,null,null,null,null,null,null,null,null,null,null,null,null,3,"-","2020-11-30",342567.3,6306920,"ZONA PAGA V461"]
[1,"Activa","ZP",533,"RM -1081","PB1991","-","I-6-454-PO-6","-","QUILICURA","Andén 13 / (EIM) Los Libertadores","U3","-","-","-","-","-","06:30:00","21:00:00","-","-","-","-","-","-","-","-","-","-","307cR",null,null,null,null,null,null,null,null,null,null,null,null,null,null,null,null,null,null,null,null,null,"-","2020-11-30",342542.2,6306921.5,"ZONA PAGA V461"]
[1,"Eliminada","ZP",534,"RM -1082","PD1613","-","L-32-5-15-OP","-","PEÑALOLÉN","Parada 4/(M) Quilin ","U4","-","-","-","-","-","06:30:00","11:00:00","16:00:00","20:30:00","-","-","-","-","-","-","-","-","D14R","D17R","D17vR",null,null,null,null,null,null,null,null,null,null,null,null,null,null,null,null,null,null,null,2,"2020-12-07",353387,6293450.2999999998,"ZONA PAGA V461"]
[1,"Activa","ZP COMPARTIDA",535,"RM -1083","PD1634","-","T-19-171-PO-5","-","LA REINA","Parada 5/ (M) Fdo.Castillo V.","U4","U2","U5","-","-","-","06:30:00","11:00:00","16:00:00","20:30:00","-","-","-","-","-","-","-","-","227R","403I","D01I","D02I","D15I","D03cI","422I",null,null,null,null,null,null,null,null,null,null,null,null,null,null,4,2,"2020-12-07",355192.44,6297495.3200000003,"ZONA PAGA V461"]
[1,"Activa","ZP COMPARTIDA",536,"-","PB128","-","T-4-12-PO-20","-","RECOLETA","Av. Américo Vespucio / esq. Avenida Recoleta","U4","U7","-","-","-","-","06:30:00","11:00:00","-","-","-","-","-","-","-","-","-","-","425I","429I","430I","435I","429cI","712R",null,null,null,null,null,null,null,null,null,null,null,null,null,null,null,4,2,"2020-12-28",347356.2,6305027.7999999998,"ZONA PAGA V461"]
[2,"Activa","ZP COMPARTIDA",537,"-","PB504","-","T-2-7-PO-7","-","CONCHALÍ","Parada 4 / Independencia - Vespucio","U4","-","-","-","-","-","06:30:00","11:00:00","-","-","-","-","-","-","-","-","-","-","425I","429I","429cR",null,null,null,null,null,null,null,null,null,null,null,null,null,null,null,null,null,null,3,3,"2020-12-23",342791.4,6306805.4000000004,"-"]

{"sheet":" Formulas","index":4,"n_rows":91,"n_cols":49,"rows_kept":91,"cut":false,"hidden":true,"merged":[]}
[]
[]
[null,null,null,null,null,null,null,null,null,null,null,null,null,null,null,null,null,null,null,null,null,null,null,null,null,null,null,null,null,null,null,null,null,null,null,null,null,null,null,null,null,"Estado","Activa"]
[null,"Estado","(Todas)",null,null,null,null,null,null,null,null,null,null,null,"Comuna","Activa","Eliminada","Espera ","Suspendida ",null,"Activa","(Todas)"]
[null,null,null,null,null,null,null,null,null,null,null,null,null,null,"CERRILLOS",1,3,null,null,null,null,null,null,null,null,null,null,null,null,null,null,null,null,null,null,null,null,null,null,null,null,"Cuenta de Comuna","Etiquetas de columna"]
[null,"Unidad de Negocio"," Validadores DTPM 3G"," Validador EXT MK Rojo",null,null,null,null,null,null,null,null,null,null,"CONCHALÍ",6,1,null,null,null,"Etiquetas de fila","Suma de Suspendida ","Suma de Eliminada","Suma de Activa",null,null,null,null,null,null,null,null,null,null,null,null,null,null,null,null,null,"Comuna","U2","U3","U4","U5","U6","U7","Total general"]
[null,"U1",null,null,null,null,null,null,null,null,null,null,null,null,"EL BOSQUE",3,6,null,null,null,"CERRILLOS",null,3,1,null,null,null,null,null,null,null,null,null,null,null,null,null,null,null,null,null,"CERRILLOS",null,null,null,1,null,null,1]
[null,"U2",null,126,null,null,null,null,null,null,null,null,null,null,"ESTACIÓN CENTRAL",8,15,null,1,null,"CONCHALÍ",null,1,6,null,null,null,null,null,null,null,null,null,null,null,null,null,null,null,null,null,"CONCHALÍ",3,null,3,null,null,null,6]
[null,"U3",null,135,null,null,null,null,null,null,null,null,null,null,"HUECHURABA",2,null,null,null,null,"CONTINGENCIA",null,0,1,null,null,null,null,null,null,null,null,null,null,null,null,null,null,null,null,null,"CONTINGENCIA",null,null,null,null,1,null,1]
[null,"U4",null,61,null,null,null,null,null,null,null,null,null,null,"INDEPENDENCIA",3,1,null,6,null,"EL BOSQUE",null,6,3,null,null,null,null,null,null,null,null,null,null,null,null,null,null,null,null,null,"EL BOSQUE",1,2,null,null,null,null,3]
[null,"U5",null,114,null,null,null,null,null,null,null,null,null,null,"LA CISTERNA",24,7,null,1,null,"ESTACIÓN CENTRAL",1,15,8,null,null,null,null,null,null,null,null,null,null,null,null,null,null,null,null,null,"ESTACIÓN CENTRAL",null,3,null,3,2,null,8]
[null,"U6",null,78,null,null,null,null,null,null,null,null,null,null,"LA FLORIDA",5,6,null,1,null,"HUECHURABA",null,null,2,null,null,null,null,null,null,null,null,null,null,null,null,null,null,null,null,null,"HUECHURABA",null,null,1,null,1,null,2]
[null,"U7",null,54,null,null,null,null,null,null,null,null,null,null,"LA GRANJA",4,2,null,1,null,"INDEPENDENCIA",6,1,3,null,null,null,null,null,null,null,null,null,null,null,null,null,null,null,null,null,"INDEPENDENCIA",3,6,null,null,null,null,9]
[null,"Total general",null,568,null,null,null,null,null,null,null,null,null,null,"LA PINTANA",4,2,null,null,null,"LA CISTERNA",1,7,24,null,null,null,null,null,null,null,null,null,null,null,null,null,null,null,null,null,"LA CISTERNA",15,4,1,null,1,3,24]
[null,null,null,null,null,null,null,null,null,null,null,null,null,null,"LA REINA",1,3,null,null,null,"LA FLORIDA",1,6,5,null,null,null,null,null,null,null,null,null,null,null,null,null,null,null,null,null,"LA FLORIDA",null,5,null,null,null,null,5]
[null,null,null,null,null,null,null,null,null,null,null,null,null,null,"LAS CONDES",9,4,null,null,null,"LA GRANJA",1,2,4,null,null,null,null,null,null,null,null,null,null,null,null,null,null,null,null,null,"LA GRANJA",3,1,null,null,null,null,4]
[null,"Unidad de Negocio"," Validadores DTPM 3G"," Validador EXT MK Rojo",null,null,null,null,null,null,null,null,null,null,"LO PRADO",9,15,null,3,null,"LA PINTANA",null,2,4,null,null,null,null,null,null,null,null,null,null,null,null,null,null,null,null,null,"LA PINTANA",4,null,null,null,null,null,4]
[null,"U1",null,null,null,null,null,null,null,null,null,null,null,null,"MACUL",2,3,null,1,null,"LA REINA",null,3,1,null,null,null,null,null,null,null,null,null,null,null,null,null,null,null,null,null,"LA REINA",null,null,1,null,null,null,1]
[null,"U2",null,126,null,null,null,null,null,null,null,null,null,null,"MAIPÚ",11,4,null,4,null,"LAS CONDES",null,4,9,null,null,null,null,null,null,null,null,null,null,null,null,null,null,null,null,null,"LAS CONDES",null,null,4,null,5,null,9]
[null,"U3",null,135,null,null,null,null,null,null,null,null,null,null,"ÑUÑOA",8,9,10,8,null,"LO PRADO",3,15,9,null,null,null,null,null,null,null,null,null,null,null,null,null,null,null,null,null,"LO PRADO",null,3,1,5,null,null,9]
[null,"U4",null,61,null,null,null,null,null,null,null,null,null,null,"PEDRO AGUIRRE CERDA",0,3,null,1,null,"MACUL",1,3,2,null,null,null,null,null,null,null,null,null,null,null,null,null,null,null,null,null,"MACUL",null,null,1,null,null,1,2]
[null,"U5",null,114,null,null,null,null,null,null,null,null,null,null,"PEÑALOLÉN",1,4,15,6,null,"MAIPÚ",4,4,11,null,null,null,null,null,null,null,null,null,null,null,null,null,null,null,null,null,"MAIPÚ",null,11,null,null,null,null,11]
[null,"U6",null,78,null,null,null,null,null,null,null,null,null,null,"PROVIDENCIA",6,9,null,4,null,"ÑUÑOA",8,9,8,null,null,null,null,null,null,null,null,null,null,null,null,null,null,null,null,null,"ÑUÑOA",1,null,2,5,null,null,8]
[null,"U7",null,54,null,null,null,null,null,null,null,null,null,null,"PUDAHUEL",4,9,null,3,null,"PEDRO AGUIRRE CERDA",1,3,0,null,null,null,null,null,null,null,null,null,null,null,null,null,null,null,null,null,"PEÑALOLÉN",null,null,null,null,null,1,1]
[null,"Total general",{"$f":"SUM(C18:C24)","v":0},{"$f":"SUM(D18:D24)","v":568},null,null,null,null,null,null,null,null,null,null,"PUENTE ALTO",18,11,null,null,null,"PEÑALOLÉN",6,4,1,null,null,null,null,null,null,null,null,null,null,null,null,null,null,null,null,null,"PROVIDENCIA",null,null,2,null,3,1,6]
[null,null,null,null,null,null,null,null,null,null,null,null,null,null,"QUILICURA",11,10,null,9,null,"PROVIDENCIA",4,9,6,null,null,null,null,null,null,null,null,null,null,null,null,null,null,null,null,null,"PUDAHUEL",null,null,null,4,null,null,4]
[null,null,null,null,null,null,null,null,null,null,null,null,null,null,"QUINTA NORMAL",1,0,null,null,null,"PUDAHUEL",3,9,4,null,null,null,null,null,null,null,null,null,null,null,null,null,null,null,null,null,"PUENTE ALTO",1,null,null,null,null,17,18]
[null,null,null,null,null,null,null,null,null,null,null,null,null,null,"RECOLETA",16,4,null,null,null,"PUENTE ALTO",null,11,18,null,null,null,null,null,null,null,null,null,null,null,null,null,null,null,null,null,"QUILICURA",null,3,1,null,7,null,11]
[null,null,null,null,null,null,null,null,null,null,null,null,null,null,"RENCA",5,3,null,null,null,"QUILICURA",9,10,11,null,null,null,null,null,null,null,null,null,null,null,null,null,null,null,null,null,"QUINTA NORMAL",null,null,null,1,null,null,1]
[null,null,null,null,null,null,null,null,null,null,null,null,null,null,"SAN BERNARDO",10,2,null,2,null,"QUINTA NORMAL",null,0,1,null,null,null,null,null,null,null,null,null,null,null,null,null,null,null,null,null,"RECOLETA",4,1,4,null,7,null,16]
[null,null,null,null,null,null,null,null,null,null,null,null,null,null,"SAN JOAQUÍN",1,1,null,null,null,"RECOLETA",null,4,16,null,null,null,null,null,null,null,null,null,null,null,null,null,null,null,null,null,"RENCA",null,null,1,null,4,null,5]
[null,null,null,null,null,null,null,null,null,null,null,null,null,null,"SAN MIGUEL",3,4,null,null,null,"RENCA",null,3,5,null,null,null,null,null,null,null,null,null,null,null,null,null,null,null,null,null,"SAN BERNARDO",3,7,null,null,null,null,10]
[null,null,null,null,null,null,null,null,null,null,null,null,null,null,"SAN RAMÓN",2,3,null,null,null,"SAN BERNARDO",2,2,10,null,null,null,null,null,null,null,null,null,null,null,null,null,null,null,null,null,"SAN JOAQUÍN",1,null,null,null,null,null,1]
[null,null,null,null,null,null,null,null,null,null,null,null,null,null,"SANTIAGO",20,50,null,7,null,"SAN JOAQUÍN",null,1,1,null,null,null,null,null,null,null,null,null,null,null,null,null,null,null,null,null,"SAN MIGUEL",2,null,1,null,null,null,3]
[null,null,null,null,null,null,null,null,null,null,null,null,null,null,"VITACURA",1,5,5,null,null,"SAN MIGUEL",null,4,3,null,null,null,null,null,null,null,null,null,null,null,null,null,null,null,null,null,"SAN RAMÓN",2,null,null,null,null,null,2]
[null,null,null,null,null,null,null,null,null,null,null,null,null,null,"CONTINGENCIA",1,0,null,null,null,"SAN RAMÓN",null,3,2,null,null,null,null,null,null,null,null,null,null,null,null,null,null,null,null,null,"SANTIAGO",10,7,1,6,null,null,24]
[null,null,null,null,null,null,null,null,null,null,null,null,null,null,"Totales",{"$f":"SUM(P5:P36)","v":200},{"$f":"SUM(Q5:Q36)","v":199},30,58,null,"SANTIAGO",7,50,20,null,null,null,null,null,null,null,null,null,null,null,null,null,null,null,null,null,"VITACURA",1,null,null,null,null,null,1]
[null,null,null,null,null,null,null,null,null,null,null,null,null,null,null,null,null,null,null,null,"VITACURA",null,5,1,null,null,null,null,null,null,null,null,null,null,null,null,null,null,null,null,null,"Total general",54,53,24,25,31,23,210]
[null,null,null,null,null,null,null,null,null,null,null,null,null,null,null,null,null,null,null,null,"Total general",58,199,200]
[]
[]
[]
[]
[]
[]
[]
[]
[]
[]
[]
[]
[]
[]
[]
[]
[]
[]
[]
[]
[]
[]
[]
[]
[]
[]
[]
[null,null,null,null,null,null,null,null,null,null,null,null,null,null,null,{"$f":"SUM(Q5:Q35)","v":199}]
[]
[]
[]
[]
[null,null,null,null,null,null,null,null,null,null,null,null,null,null,null,{"$f":"SUM(R5:R35)","v":30}]
[]
[]
[]
[]
[]
[]
[]
[]
[]
[]
[]
[]
[]
[]
[]
[]
[]
[]
[null,null,null,null,null,null,null,null,null,null,null,null,null,null,null,{"$f":"SUM(S8:S34)","v":58}]

{"sheet":"Cuadro Vigencia ","index":5,"n_rows":11,"n_cols":6,"rows_kept":11,"cut":false,"hidden":true,"merged":[]}
[]
["Cuenta de Estado","Etiquetas de columna"]
["Etiquetas de fila","Activa","Eliminada","Espera ","Suspendida ","Total general"]
["NA",null,118,null,null,118]
["U2",48,3,null,3,54]
["U3",41,6,null,25,72]
["U4",21,39,null,1,61]
["U5",17,30,25,22,94]
["U6",23,2,null,4,29]
["U7",23,null,null,null,23]
["Total general",173,198,25,55,451]